Build failed. If you want to re-trigger a documentation build, you can do it here. You can find more information on docs.rs builds documentation on the builds page.
# error kind ExecutionFailed
# pre-build errors command failed: exit status: 101
# rustc version rustc 1.100.0-nightly (f248f4038 2026-09-05)
# docs.rs version docsrs 0.0.0 (c6ca30c0fecf66cc5a0859ac541222ca6c912d59 2026-09-01 )
# build log [INFO] running `Command { std: "docker" "exec" "-e" "SOURCE_DIR=/opt/rustwide/workdir" "-e" "CARGO_HOME=/opt/rustwide/cargo-home" "-e" "RUSTUP_HOME=/opt/rustwide/rustup-home" "-e" "CARGO_TARGET_DIR=/opt/rustwide/target" "-e" "DOCS_RS=1" "-w" "/opt/rustwide/workdir" "--user" "1001:1001" "f0114021ae061271a4b34e1d1f8d15729d0a56c867c7ce89c5106857a586ab02" "/opt/rustwide/cargo-home/bin/cargo" "+nightly" "rustdoc" "--lib" "-Zrustdoc-map" "--config" "build.rustdocflags=[\"--cfg\", \"docsrs\", \"-Z\", \"unstable-options\", \"--emit=html-non-static-files\", \"--resource-suffix\", \"-20260905-1.100.0-nightly-f248f4038\", \"--static-root-path\", \"/-/rustdoc.static/\", \"--cap-lints\", \"warn\", \"--extern-html-root-takes-precedence\"]" "--offline" "-Zunstable-options" "--config=doc.extern-map.registries.crates-io=\"https://docs.rs/{pkg_name}/{version}/x86_64-unknown-linux-gnu\"" "-j11" "--target" "x86_64-unknown-linux-gnu" "-Zrustdoc-scrape-examples", kill_on_drop: false }` [INFO] [stderr] warning: explicit `package.readme` can be inferred [INFO] [stderr] --> Cargo.toml:55:1 [INFO] [stderr] | [INFO] [stderr] 55 | readme = "README.md" [INFO] [stderr] | ^^^^^^^^^^^^^^^^^^^^ [INFO] [stderr] | [INFO] [stderr] = note: `cargo::manual_readme` is set to `warn` by default [INFO] [stderr] help: consider removing `package.readme` [INFO] [stderr] warning: `oat_python` (manifest) generated 1 warning [INFO] [stderr] warning: target filter specified, but no targets matched; this is a no-op [INFO] [stderr] Checking oat_rust v0.1.1 [INFO] [stderr] error[E0432]: unresolved import `good_lp::minilp` [INFO] [stderr] --> /opt/rustwide/cargo-home/registry/src/index.crates.io-1949cf8c6b5b557f/oat_rust-0.1.1/src/utilities/optimization/minimize_l1.rs:23:38 [INFO] [stderr] | [INFO] [stderr] 23 | use good_lp::{SolverModel, Solution, minilp, Expression, Variable, ProblemVariables}; [INFO] [stderr] | ^^^^^^ no `minilp` in the root [INFO] [stderr] [INFO] [stderr] error[E0308]: mismatched types [INFO] [stderr] --> /opt/rustwide/cargo-home/registry/src/index.crates.io-1949cf8c6b5b557f/oat_rust-0.1.1/src/utilities/optimization/minimize_l1.rs:279:52 [INFO] [stderr] | [INFO] [stderr] 150 | Key, [INFO] [stderr] | --- expected this type parameter [INFO] [stderr] ... [INFO] [stderr] 279 | .filter(|x| x.1 != 0.0 ) [INFO] [stderr] | ^^^ expected type parameter `Key`, found floating-point number [INFO] [stderr] | [INFO] [stderr] = note: expected type parameter `Key` [INFO] [stderr] found type `{float}` [INFO] [stderr] [INFO] [stderr] error[E0308]: mismatched types [INFO] [stderr] --> /opt/rustwide/cargo-home/registry/src/index.crates.io-1949cf8c6b5b557f/oat_rust-0.1.1/src/utilities/optimization/minimize_l1.rs:450:52 [INFO] [stderr] | [INFO] [stderr] 330 | Key, [INFO] [stderr] | --- expected this type parameter [INFO] [stderr] ... [INFO] [stderr] 450 | .filter(|x| x.1 != 0.0 ) [INFO] [stderr] | ^^^ expected type parameter `Key`, found floating-point number [INFO] [stderr] | [INFO] [stderr] = note: expected type parameter `Key` [INFO] [stderr] found type `{float}` [INFO] [stderr] [INFO] [stderr] Some errors have detailed explanations: E0308, E0432. [INFO] [stderr] For more information about an error, try `rustc --explain E0308`. [INFO] [stderr] error: could not compile `oat_rust` (lib) due to 3 previous errors [INFO] running `Command { std: "docker" "inspect" "f0114021ae061271a4b34e1d1f8d15729d0a56c867c7ce89c5106857a586ab02", kill_on_drop: false }`