trace_decoder 0.7.0

Ethereum node witness -> Prover input
Documentation
Build #2213799 2025-06-09 21:56:07

Build failed. If you want to re-trigger a documentation build, you can do it here. You can find more information on docs.rs builds documentation on the builds page.

# rustc version
rustc 1.89.0-nightly (6ccd44760 2025-06-08)# docs.rs version
docsrs 0.6.0 (d2911047 2025-05-28)# build log
[INFO] running `Command { std: "docker" "create" "-v" "/home/cratesfyi/workspace/builds/trace_decoder-0.7.0/target:/opt/rustwide/target:rw,Z" "-v" "/home/cratesfyi/workspace/builds/trace_decoder-0.7.0/source:/opt/rustwide/workdir:ro,Z" "-v" "/home/cratesfyi/workspace/cargo-home:/opt/rustwide/cargo-home:ro,Z" "-v" "/home/cratesfyi/workspace/rustup-home:/opt/rustwide/rustup-home:ro,Z" "-e" "SOURCE_DIR=/opt/rustwide/workdir" "-e" "CARGO_TARGET_DIR=/opt/rustwide/target" "-e" "DOCS_RS=1" "-e" "CARGO_HOME=/opt/rustwide/cargo-home" "-e" "RUSTUP_HOME=/opt/rustwide/rustup-home" "-w" "/opt/rustwide/workdir" "-m" "6442450944" "--cpus" "6" "--user" "1001:1001" "--network" "none" "ghcr.io/rust-lang/crates-build-env/linux@sha256:eea15d5475069c3ef791f10c2c6b5af2ee421ef2da1e680ecce1cba46243983b" "/opt/rustwide/cargo-home/bin/cargo" "+nightly" "rustdoc" "--lib" "-Zrustdoc-map" "--config" "build.rustdocflags=[\"--cfg\", \"docsrs\", \"-Z\", \"unstable-options\", \"--emit=invocation-specific\", \"--resource-suffix\", \"-20250608-1.89.0-nightly-6ccd44760\", \"--static-root-path\", \"/-/rustdoc.static/\", \"--cap-lints\", \"warn\", \"--extern-html-root-takes-precedence\"]" "--offline" "-Zunstable-options" "--config=doc.extern-map.registries.crates-io=\"https://docs.rs/{pkg_name}/{version}/x86_64-unknown-linux-gnu\"" "-Zrustdoc-scrape-examples" "-j6" "--target" "x86_64-unknown-linux-gnu" "--config" "build.rustdocflags=[\"-Zmetrics-dir=/opt/rustwide/target/metrics\"]", kill_on_drop: false }`
[INFO] [stderr] WARNING: Your kernel does not support swap limit capabilities or the cgroup is not mounted. Memory limited without swap.
[INFO] [stdout] 1fb4779bf812bcbee898a85d5f5fedf96a3dbca1c703e620cfab5c437bb148e3
[INFO] running `Command { std: "docker" "start" "-a" "1fb4779bf812bcbee898a85d5f5fedf96a3dbca1c703e620cfab5c437bb148e3", kill_on_drop: false }`
[INFO] [stderr] warning: target filter specified, but no targets matched; this is a no-op
[INFO] [stderr]     Checking evm_arithmetization v0.5.1
[INFO] [stderr] error[E0277]: the trait bound `Challenger<F, <C as plonky2::plonk::config::GenericConfig<D>>::Hasher>: Stark<F, D>` is not satisfied
[INFO] [stderr]    --> /opt/rustwide/cargo-home/registry/src/index.crates.io-1949cf8c6b5b557f/evm_arithmetization-0.5.1/src/get_challenges.rs:302:29
[INFO] [stderr]     |
[INFO] [stderr] 301 |                         Some(stark_proof.proof.get_challenges(
[INFO] [stderr]     |                                                -------------- required by a bound introduced by this call
[INFO] [stderr] 302 |                             &mut challenger,
[INFO] [stderr]     |                             ^^^^^^^^^^^^^^^ the trait `Stark<F, D>` is not implemented for `Challenger<F, <C as plonky2::plonk::config::GenericConfig<D>>::Hasher>`
[INFO] [stderr]     |
[INFO] [stderr]     = help: the following other types implement trait `Stark<F, D>`:
[INFO] [stderr]               ArithmeticStark<F, D>
[INFO] [stderr]               BytePackingStark<F, D>
[INFO] [stderr]               CpuStark<F, D>
[INFO] [stderr]               KeccakSpongeStark<F, D>
[INFO] [stderr]               KeccakStark<F, D>
[INFO] [stderr]               LogicStark<F, D>
[INFO] [stderr]               MemoryContinuationStark<F, D>
[INFO] [stderr]               MemoryStark<F, D>
[INFO] [stderr] note: required by a bound in `starky::get_challenges::<impl StarkProof<F, C, D>>::get_challenges`
[INFO] [stderr]    --> /opt/rustwide/cargo-home/registry/src/index.crates.io-1949cf8c6b5b557f/starky-1.1.0/src/get_challenges.rs:270:30
[INFO] [stderr]     |
[INFO] [stderr] 270 |     pub fn get_challenges<S: Stark<F, D>>(
[INFO] [stderr]     |                              ^^^^^^^^^^^ required by this bound in `starky::get_challenges::<impl StarkProof<F, C, D>>::get_challenges`
[INFO] [stderr] 
[INFO] [stderr] error[E0061]: this method takes 8 arguments but 5 arguments were supplied
[INFO] [stderr]    --> /opt/rustwide/cargo-home/registry/src/index.crates.io-1949cf8c6b5b557f/evm_arithmetization-0.5.1/src/get_challenges.rs:301:48
[INFO] [stderr]     |
[INFO] [stderr] 301 |                            Some(stark_proof.proof.get_challenges(
[INFO] [stderr]     |  _________________________________________________^^^^^^^^^^^^^^-
[INFO] [stderr] 302 | |                              &mut challenger,
[INFO] [stderr] 303 | |/                             Some(&ctl_challenges),
[INFO] [stderr] 304 | ||                             true,
[INFO] [stderr]     | ||________________________________- two arguments of type `&[F]` and `&mut Challenger<F, <C as plonky2::plonk::config::GenericConfig<D>>::Hasher>` are missing
[INFO] [stderr] 305 | |                              config,
[INFO] [stderr] 306 | |                              None,
[INFO] [stderr] 307 | |                          ))
[INFO] [stderr]     | |__________________________- argument #8 of type `std::option::Option<FriParams>` is missing
[INFO] [stderr]     |
[INFO] [stderr] note: method defined here
[INFO] [stderr]    --> /opt/rustwide/cargo-home/registry/src/index.crates.io-1949cf8c6b5b557f/starky-1.1.0/src/get_challenges.rs:270:12
[INFO] [stderr]     |
[INFO] [stderr] 270 |     pub fn get_challenges<S: Stark<F, D>>(
[INFO] [stderr]     |            ^^^^^^^^^^^^^^
[INFO] [stderr] help: provide the arguments
[INFO] [stderr]     |
[INFO] [stderr] 301 -                         Some(stark_proof.proof.get_challenges(
[INFO] [stderr] 302 -                             &mut challenger,
[INFO] [stderr] 303 -                             Some(&ctl_challenges),
[INFO] [stderr] 304 -                             true,
[INFO] [stderr] 305 -                             config,
[INFO] [stderr] 306 -                             None,
[INFO] [stderr] 307 -                         ))
[INFO] [stderr] 301 +                         Some(stark_proof.proof.get_challenges(&mut challenger, /* &[F] */, /* &mut Challenger<F, <C as plonky2::plonk::config::GenericConfig<D>>::Hasher> */, Some(&ctl_challenges), None, true, config, /* std::option::Option<FriParams> */))
[INFO] [stderr]     |
[INFO] [stderr] 
[INFO] [stderr] error[E0107]: method takes 3 generic arguments but 2 generic arguments were supplied
[INFO] [stderr]    --> /opt/rustwide/cargo-home/registry/src/index.crates.io-1949cf8c6b5b557f/evm_arithmetization-0.5.1/src/recursive_verifier.rs:294:41
[INFO] [stderr]     |
[INFO] [stderr] 294 |     let challenges = stark_proof_target.get_challenges::<F, C>(
[INFO] [stderr]     |                                         ^^^^^^^^^^^^^^   -  - supplied 2 generic arguments
[INFO] [stderr]     |                                         |
[INFO] [stderr]     |                                         expected 3 generic arguments
[INFO] [stderr]     |
[INFO] [stderr] note: method defined here, with 3 generic parameters: `F`, `C`, `S`
[INFO] [stderr]    --> /opt/rustwide/cargo-home/registry/src/index.crates.io-1949cf8c6b5b557f/starky-1.1.0/src/get_challenges.rs:582:12
[INFO] [stderr]     |
[INFO] [stderr] 582 |     pub fn get_challenges<F, C, S: Stark<F, D>>(
[INFO] [stderr]     |            ^^^^^^^^^^^^^^ -  -  -
[INFO] [stderr] help: add missing generic argument
[INFO] [stderr]     |
[INFO] [stderr] 294 |     let challenges = stark_proof_target.get_challenges::<F, C, S>(
[INFO] [stderr]     |                                                              +++
[INFO] [stderr] 
[INFO] [stderr] error[E0277]: the trait bound `RecursiveChallenger<F, ..., D>: Stark<..., D>` is not satisfied
[INFO] [stderr]    --> /opt/rustwide/cargo-home/registry/src/index.crates.io-1949cf8c6b5b557f/evm_arithmetization-0.5.1/src/recursive_verifier.rs:296:9
[INFO] [stderr]     |
[INFO] [stderr] 294 |     let challenges = stark_proof_target.get_challenges::<F, C>(
[INFO] [stderr]     |                                         -------------- required by a bound introduced by this call
[INFO] [stderr] 295 |         &mut builder,
[INFO] [stderr] 296 |         &mut challenger,
[INFO] [stderr]     |         ^^^^^^^^^^^^^^^ the trait `Stark<F, D>` is not implemented for `RecursiveChallenger<F, <C as plonky2::plonk::config::GenericConfig<D>>::Hasher, D>`
[INFO] [stderr]     |
[INFO] [stderr]     = help: the following other types implement trait `Stark<F, D>`:
[INFO] [stderr]               ArithmeticStark<F, D>
[INFO] [stderr]               BytePackingStark<F, D>
[INFO] [stderr]               CpuStark<F, D>
[INFO] [stderr]               KeccakSpongeStark<F, D>
[INFO] [stderr]               KeccakStark<F, D>
[INFO] [stderr]               LogicStark<F, D>
[INFO] [stderr]               MemoryContinuationStark<F, D>
[INFO] [stderr]               MemoryStark<F, D>
[INFO] [stderr] note: required by a bound in `starky::get_challenges::<impl StarkProofTarget<D>>::get_challenges`
[INFO] [stderr]    --> /opt/rustwide/cargo-home/registry/src/index.crates.io-1949cf8c6b5b557f/starky-1.1.0/src/get_challenges.rs:582:36
[INFO] [stderr]     |
[INFO] [stderr] 582 |     pub fn get_challenges<F, C, S: Stark<F, D>>(
[INFO] [stderr]     |                                    ^^^^^^^^^^^ required by this bound in `starky::get_challenges::<impl StarkProofTarget<D>>::get_challenges`
[INFO] [stderr]     = note: the full name for the type has been written to '/opt/rustwide/target/x86_64-unknown-linux-gnu/debug/deps/evm_arithmetization-4f228a9bd29755ed.long-type-3296679436101820406.txt'
[INFO] [stderr]     = note: consider using `--verbose` to print the full type name to the console
[INFO] [stderr] 
[INFO] [stderr] error[E0061]: this method takes 9 arguments but 5 arguments were supplied
[INFO] [stderr]    --> /opt/rustwide/cargo-home/registry/src/index.crates.io-1949cf8c6b5b557f/evm_arithmetization-0.5.1/src/recursive_verifier.rs:294:41
[INFO] [stderr]     |
[INFO] [stderr] 294 |        let challenges = stark_proof_target.get_challenges::<F, C>(
[INFO] [stderr]     |  __________________________________________^^^^^^^^^^^^^^^^^^^^^^-
[INFO] [stderr] 295 | |          &mut builder,
[INFO] [stderr] 296 | |          &mut challenger,
[INFO] [stderr] 297 | |/         Some(&ctl_challenges_target),
[INFO] [stderr] 298 | ||         true,
[INFO] [stderr]     | ||____________- two arguments of type `&[plonky2::iop::target::Target]` and `&mut RecursiveChallenger<F, <C as plonky2::plonk::config::GenericConfig<D>>::Hasher, D>` are missing
[INFO] [stderr] 299 | |          inner_config,
[INFO] [stderr] 300 | |      );
[INFO] [stderr]     | |______- two arguments of type `std::option::Option<&[CtlCheckVarsTarget<F, D>]>` and `usize` are missing
[INFO] [stderr]     |
[INFO] [stderr] note: method defined here
[INFO] [stderr]    --> /opt/rustwide/cargo-home/registry/src/index.crates.io-1949cf8c6b5b557f/starky-1.1.0/src/get_challenges.rs:582:12
[INFO] [stderr]     |
[INFO] [stderr] 582 |     pub fn get_challenges<F, C, S: Stark<F, D>>(
[INFO] [stderr]     |            ^^^^^^^^^^^^^^
[INFO] [stderr] help: provide the arguments
[INFO] [stderr]     |
[INFO] [stderr] 294 -     let challenges = stark_proof_target.get_challenges::<F, C>(
[INFO] [stderr] 295 -         &mut builder,
[INFO] [stderr] 296 -         &mut challenger,
[INFO] [stderr] 297 -         Some(&ctl_challenges_target),
[INFO] [stderr] 298 -         true,
[INFO] [stderr] 299 -         inner_config,
[INFO] [stderr] 300 -     );
[INFO] [stderr] 294 +     let challenges = stark_proof_target.get_challenges::<F, C>(&mut builder, &mut challenger, /* &[plonky2::iop::target::Target] */, /* &mut RecursiveChallenger<F, <C as plonky2::plonk::config::GenericConfig<D>>::Hasher, D> */, Some(&ctl_challenges_target), /* std::option::Option<&[CtlCheckVarsTarget<F, D>]> */, /* usize */, true, inner_config);
[INFO] [stderr]     |
[INFO] [stderr] 
[INFO] [stderr] Some errors have detailed explanations: E0061, E0107, E0277.
[INFO] [stderr] For more information about an error, try `rustc --explain E0061`.
[INFO] [stderr] error: could not compile `evm_arithmetization` (lib) due to 5 previous errors
[INFO] running `Command { std: "docker" "inspect" "1fb4779bf812bcbee898a85d5f5fedf96a3dbca1c703e620cfab5c437bb148e3", kill_on_drop: false }`
[INFO] running `Command { std: "docker" "rm" "-f" "1fb4779bf812bcbee898a85d5f5fedf96a3dbca1c703e620cfab5c437bb148e3", kill_on_drop: false }`
[INFO] [stdout] 1fb4779bf812bcbee898a85d5f5fedf96a3dbca1c703e620cfab5c437bb148e3