signal_processing 0.3.0

A signal processing library.
Documentation
Build #2338216 2025-07-21 18:29:39

Build failed. If you want to re-trigger a documentation build, you can do it here. You can find more information on docs.rs builds documentation on the builds page.

# rustc version
rustc 1.90.0-nightly (9982d6462 2025-07-20)# docs.rs version
docsrs 0.6.0 (c1135d19 2025-07-02)# build log
[INFO] running `Command { std: "docker" "create" "-v" "/home/cratesfyi/workspace/builds/signal_processing-0.3.0/target:/opt/rustwide/target:rw,Z" "-v" "/home/cratesfyi/workspace/builds/signal_processing-0.3.0/source:/opt/rustwide/workdir:ro,Z" "-v" "/home/cratesfyi/workspace/cargo-home:/opt/rustwide/cargo-home:ro,Z" "-v" "/home/cratesfyi/workspace/rustup-home:/opt/rustwide/rustup-home:ro,Z" "-e" "SOURCE_DIR=/opt/rustwide/workdir" "-e" "CARGO_TARGET_DIR=/opt/rustwide/target" "-e" "DOCS_RS=1" "-e" "CARGO_HOME=/opt/rustwide/cargo-home" "-e" "RUSTUP_HOME=/opt/rustwide/rustup-home" "-w" "/opt/rustwide/workdir" "-m" "6442450944" "--cpus" "6" "--user" "1001:1001" "--network" "none" "ghcr.io/rust-lang/crates-build-env/linux@sha256:cf8efcab8866f2cf4285301c7418e2f4f2a9b088c91ba69c40d5b659f81557f7" "/opt/rustwide/cargo-home/bin/cargo" "+nightly" "rustdoc" "--lib" "-Zrustdoc-map" "--config" "build.rustdocflags=[\"--cfg\", \"docsrs\", \"-Z\", \"unstable-options\", \"--emit=invocation-specific\", \"--resource-suffix\", \"-20250720-1.90.0-nightly-9982d6462\", \"--static-root-path\", \"/-/rustdoc.static/\", \"--cap-lints\", \"warn\", \"--extern-html-root-takes-precedence\"]" "--offline" "-Zunstable-options" "--config=doc.extern-map.registries.crates-io=\"https://docs.rs/{pkg_name}/{version}/x86_64-unknown-linux-gnu\"" "-Zrustdoc-scrape-examples" "-j6" "--target" "x86_64-unknown-linux-gnu", kill_on_drop: false }`
[INFO] [stderr] WARNING: Your kernel does not support swap limit capabilities or the cgroup is not mounted. Memory limited without swap.
[INFO] [stdout] 8dce26daec0b2c7807063c4e898b59d30aa12ea3029c6cd969178c587c18ffce
[INFO] running `Command { std: "docker" "start" "-a" "8dce26daec0b2c7807063c4e898b59d30aa12ea3029c6cd969178c587c18ffce", kill_on_drop: false }`
[INFO] [stderr] warning: target filter specified, but no targets matched; this is a no-op
[INFO] [stderr]     Checking array__ops v0.1.20
[INFO] [stderr]     Checking option_trait v0.1.16
[INFO] [stderr]     Checking slice_math v0.1.31
[INFO] [stderr] error[E0635]: unknown feature `maybe_uninit_uninit_array`
[INFO] [stderr]  --> /opt/rustwide/cargo-home/registry/src/index.crates.io-1949cf8c6b5b557f/option_trait-0.1.16/src/lib.rs:8:12
[INFO] [stderr]   |
[INFO] [stderr] 8 | #![feature(maybe_uninit_uninit_array)]
[INFO] [stderr]   |            ^^^^^^^^^^^^^^^^^^^^^^^^^
[INFO] [stderr] 
[INFO] [stderr] error[E0658]: use of unstable const library feature `const_from`
[INFO] [stderr]   --> /opt/rustwide/cargo-home/registry/src/index.crates.io-1949cf8c6b5b557f/option_trait-0.1.16/src/option_kind.rs:12:18
[INFO] [stderr]    |
[INFO] [stderr] 12 | impl<Some> const From<&Option<Some>> for OptionKind
[INFO] [stderr]    |                  ^^^^^^^^^^^^^^^^^^^ trait is not stable as const yet
[INFO] [stderr]    |
[INFO] [stderr]    = note: see issue #143773 <https://github.com/rust-lang/rust/issues/143773> for more information
[INFO] [stderr]    = help: add `#![feature(const_from)]` to the crate attributes to enable
[INFO] [stderr]    = note: this compiler was built on 2025-07-20; consider upgrading it if it is out of date
[INFO] [stderr] 
[INFO] [stderr] error: const `impl` for trait `OptionObj` which is not `const`
[INFO] [stderr]   --> /opt/rustwide/cargo-home/registry/src/index.crates.io-1949cf8c6b5b557f/option_trait-0.1.16/src/option_obj.rs:22:18
[INFO] [stderr]    |
[INFO] [stderr] 22 | impl<Some> const OptionObj for Option<Some>
[INFO] [stderr]    |                  ^^^^^^^^^ this trait is not `const`
[INFO] [stderr]    |
[INFO] [stderr]    = note: marking a trait with `const` ensures all default method bodies are `const`
[INFO] [stderr]    = note: adding a non-const method body in the future would be a breaking change
[INFO] [stderr] help: mark `OptionObj` as `const` to allow it to have `const` implementations
[INFO] [stderr]    |
[INFO] [stderr] 3  | #[const_trait] pub trait OptionObj: private::Optional
[INFO] [stderr]    | ++++++++++++++
[INFO] [stderr] 
[INFO] [stderr] error: const `impl` for trait `Maybe` which is not `const`
[INFO] [stderr]   --> /opt/rustwide/cargo-home/registry/src/index.crates.io-1949cf8c6b5b557f/option_trait-0.1.16/src/maybe.rs:13:18
[INFO] [stderr]    |
[INFO] [stderr] 13 | impl<Some> const Maybe<Some> for Some
[INFO] [stderr]    |                  ^^^^^^^^^^^ this trait is not `const`
[INFO] [stderr]    |
[INFO] [stderr]    = note: marking a trait with `const` ensures all default method bodies are `const`
[INFO] [stderr]    = note: adding a non-const method body in the future would be a breaking change
[INFO] [stderr] help: mark `Maybe` as `const` to allow it to have `const` implementations
[INFO] [stderr]    |
[INFO] [stderr] 3  | #[const_trait] pub trait Maybe<T>: private::Maybe<T>
[INFO] [stderr]    | ++++++++++++++
[INFO] [stderr] 
[INFO] [stderr] error: const `impl` for trait `Optional` which is not `const`
[INFO] [stderr]  --> /opt/rustwide/cargo-home/registry/src/index.crates.io-1949cf8c6b5b557f/option_trait-0.1.16/src/optional.rs:9:18
[INFO] [stderr]   |
[INFO] [stderr] 9 | impl<Some> const Optional for Option<Some>
[INFO] [stderr]   |                  ^^^^^^^^ this trait is not `const`
[INFO] [stderr]   |
[INFO] [stderr]   = note: marking a trait with `const` ensures all default method bodies are `const`
[INFO] [stderr]   = note: adding a non-const method body in the future would be a breaking change
[INFO] [stderr] help: mark `Optional` as `const` to allow it to have `const` implementations
[INFO] [stderr]   |
[INFO] [stderr] 3 | #[const_trait] pub trait Optional: OptionObj + Maybe<Self::Some>
[INFO] [stderr]   | ++++++++++++++
[INFO] [stderr] 
[INFO] [stderr] error: const `impl` for trait `Maybe` which is not `const`
[INFO] [stderr]   --> /opt/rustwide/cargo-home/registry/src/index.crates.io-1949cf8c6b5b557f/option_trait-0.1.16/src/maybe.rs:51:18
[INFO] [stderr]    |
[INFO] [stderr] 51 | impl<Some> const Maybe<Some> for Option<Some>
[INFO] [stderr]    |                  ^^^^^^^^^^^ this trait is not `const`
[INFO] [stderr]    |
[INFO] [stderr]    = note: marking a trait with `const` ensures all default method bodies are `const`
[INFO] [stderr]    = note: adding a non-const method body in the future would be a breaking change
[INFO] [stderr] help: mark `Maybe` as `const` to allow it to have `const` implementations
[INFO] [stderr]    |
[INFO] [stderr] 3  | #[const_trait] pub trait Maybe<T>: private::Maybe<T>
[INFO] [stderr]    | ++++++++++++++
[INFO] [stderr] 
[INFO] [stderr] error: const `impl` for trait `Maybe` which is not `const`
[INFO] [stderr]   --> /opt/rustwide/cargo-home/registry/src/index.crates.io-1949cf8c6b5b557f/option_trait-0.1.16/src/maybe.rs:32:18
[INFO] [stderr]    |
[INFO] [stderr] 32 | impl<Some> const Maybe<Some> for ()
[INFO] [stderr]    |                  ^^^^^^^^^^^ this trait is not `const`
[INFO] [stderr]    |
[INFO] [stderr]    = note: marking a trait with `const` ensures all default method bodies are `const`
[INFO] [stderr]    = note: adding a non-const method body in the future would be a breaking change
[INFO] [stderr] help: mark `Maybe` as `const` to allow it to have `const` implementations
[INFO] [stderr]    |
[INFO] [stderr] 3  | #[const_trait] pub trait Maybe<T>: private::Maybe<T>
[INFO] [stderr]    | ++++++++++++++
[INFO] [stderr] 
[INFO] [stderr] error: const `impl` for trait `StaticMaybe` which is not `const`
[INFO] [stderr]   --> /opt/rustwide/cargo-home/registry/src/index.crates.io-1949cf8c6b5b557f/option_trait-0.1.16/src/static_maybe.rs:37:18
[INFO] [stderr]    |
[INFO] [stderr] 37 | impl<Some> const StaticMaybe<Some> for Some
[INFO] [stderr]    |                  ^^^^^^^^^^^^^^^^^ this trait is not `const`
[INFO] [stderr]    |
[INFO] [stderr]    = note: marking a trait with `const` ensures all default method bodies are `const`
[INFO] [stderr]    = note: adding a non-const method body in the future would be a breaking change
[INFO] [stderr] help: mark `StaticMaybe` as `const` to allow it to have `const` implementations
[INFO] [stderr]    |
[INFO] [stderr] 3  | #[const_trait] pub trait StaticMaybe<T>: Maybe<T>
[INFO] [stderr]    | ++++++++++++++
[INFO] [stderr] 
[INFO] [stderr] error: const `impl` for trait `StaticMaybe` which is not `const`
[INFO] [stderr]   --> /opt/rustwide/cargo-home/registry/src/index.crates.io-1949cf8c6b5b557f/option_trait-0.1.16/src/static_maybe.rs:80:18
[INFO] [stderr]    |
[INFO] [stderr] 80 | impl<Some> const StaticMaybe<Some> for ()
[INFO] [stderr]    |                  ^^^^^^^^^^^^^^^^^ this trait is not `const`
[INFO] [stderr]    |
[INFO] [stderr]    = note: marking a trait with `const` ensures all default method bodies are `const`
[INFO] [stderr]    = note: adding a non-const method body in the future would be a breaking change
[INFO] [stderr] help: mark `StaticMaybe` as `const` to allow it to have `const` implementations
[INFO] [stderr]    |
[INFO] [stderr] 3  | #[const_trait] pub trait StaticMaybe<T>: Maybe<T>
[INFO] [stderr]    | ++++++++++++++
[INFO] [stderr] 
[INFO] [stderr] error: const `impl` for trait `StaticMaybe` which is not `const`
[INFO] [stderr]    --> /opt/rustwide/cargo-home/registry/src/index.crates.io-1949cf8c6b5b557f/option_trait-0.1.16/src/static_maybe.rs:123:12
[INFO] [stderr]     |
[INFO] [stderr] 123 | impl const StaticMaybe<()> for ()
[INFO] [stderr]     |            ^^^^^^^^^^^^^^^ this trait is not `const`
[INFO] [stderr]     |
[INFO] [stderr]     = note: marking a trait with `const` ensures all default method bodies are `const`
[INFO] [stderr]     = note: adding a non-const method body in the future would be a breaking change
[INFO] [stderr] help: mark `StaticMaybe` as `const` to allow it to have `const` implementations
[INFO] [stderr]     |
[INFO] [stderr] 3   | #[const_trait] pub trait StaticMaybe<T>: Maybe<T>
[INFO] [stderr]     | ++++++++++++++
[INFO] [stderr] 
[INFO] [stderr] error: const `impl` for trait `StaticMaybe` which is not `const`
[INFO] [stderr]    --> /opt/rustwide/cargo-home/registry/src/index.crates.io-1949cf8c6b5b557f/option_trait-0.1.16/src/static_maybe.rs:164:18
[INFO] [stderr]     |
[INFO] [stderr] 164 | impl<Some> const StaticMaybe<Some> for MaybeCell<Some, true>
[INFO] [stderr]     |                  ^^^^^^^^^^^^^^^^^ this trait is not `const`
[INFO] [stderr]     |
[INFO] [stderr]     = note: marking a trait with `const` ensures all default method bodies are `const`
[INFO] [stderr]     = note: adding a non-const method body in the future would be a breaking change
[INFO] [stderr] help: mark `StaticMaybe` as `const` to allow it to have `const` implementations
[INFO] [stderr]     |
[INFO] [stderr] 3   | #[const_trait] pub trait StaticMaybe<T>: Maybe<T>
[INFO] [stderr]     | ++++++++++++++
[INFO] [stderr] 
[INFO] [stderr] error: const `impl` for trait `StaticMaybe` which is not `const`
[INFO] [stderr]    --> /opt/rustwide/cargo-home/registry/src/index.crates.io-1949cf8c6b5b557f/option_trait-0.1.16/src/static_maybe.rs:207:18
[INFO] [stderr]     |
[INFO] [stderr] 207 | impl<Some> const StaticMaybe<Some> for MaybeCell<Some, false>
[INFO] [stderr]     |                  ^^^^^^^^^^^^^^^^^ this trait is not `const`
[INFO] [stderr]     |
[INFO] [stderr]     = note: marking a trait with `const` ensures all default method bodies are `const`
[INFO] [stderr]     = note: adding a non-const method body in the future would be a breaking change
[INFO] [stderr] help: mark `StaticMaybe` as `const` to allow it to have `const` implementations
[INFO] [stderr]     |
[INFO] [stderr] 3   | #[const_trait] pub trait StaticMaybe<T>: Maybe<T>
[INFO] [stderr]     | ++++++++++++++
[INFO] [stderr] 
[INFO] [stderr] error: let chains are only allowed in Rust 2024 or later
[INFO] [stderr]     --> /opt/rustwide/cargo-home/registry/src/index.crates.io-1949cf8c6b5b557f/array__ops-0.1.20/src/array_ops.rs:2723:12
[INFO] [stderr]      |
[INFO] [stderr] 2723 |         if let Some(uv) = uv && let Some(uu) = uu
[INFO] [stderr]      |            ^^^^^^^^^^^^^^^^^
[INFO] [stderr] 
[INFO] [stderr] error: let chains are only allowed in Rust 2024 or later
[INFO] [stderr]     --> /opt/rustwide/cargo-home/registry/src/index.crates.io-1949cf8c6b5b557f/array__ops-0.1.20/src/array_ops.rs:2723:33
[INFO] [stderr]      |
[INFO] [stderr] 2723 |         if let Some(uv) = uv && let Some(uu) = uu
[INFO] [stderr]      |                                 ^^^^^^^^^^^^^^^^^
[INFO] [stderr] 
[INFO] [stderr] error[E0599]: no function or associated item named `uninit_array` found for union `MaybeUninit` in the current scope
[INFO] [stderr]    --> /opt/rustwide/cargo-home/registry/src/index.crates.io-1949cf8c6b5b557f/option_trait-0.1.16/src/maybe_cell.rs:47:34
[INFO] [stderr]     |
[INFO] [stderr] 47  |         let mut x = MaybeUninit::uninit_array();
[INFO] [stderr]     |                                  ^^^^^^^^^^^^ function or associated item not found in `MaybeUninit<_>`
[INFO] [stderr]     |
[INFO] [stderr] note: if you're trying to build a new `MaybeUninit<_>` consider using one of the following associated functions:
[INFO] [stderr]       MaybeUninit::<T>::new
[INFO] [stderr]       MaybeUninit::<T>::uninit
[INFO] [stderr]       MaybeUninit::<T>::zeroed
[INFO] [stderr]    --> /opt/rustwide/rustup-home/toolchains/nightly-x86_64-unknown-linux-gnu/lib/rustlib/src/rust/library/core/src/mem/maybe_uninit.rs:307:5
[INFO] [stderr]     |
[INFO] [stderr] 307 |     pub const fn new(val: T) -> MaybeUninit<T> {
[INFO] [stderr]     |     ^^^^^^^^^^^^^^^^^^^^^^^^^^^^^^^^^^^^^^^^^^
[INFO] [stderr] ...
[INFO] [stderr] 330 |     pub const fn uninit() -> MaybeUninit<T> {
[INFO] [stderr]     |     ^^^^^^^^^^^^^^^^^^^^^^^^^^^^^^^^^^^^^^^
[INFO] [stderr] ...
[INFO] [stderr] 380 |     pub const fn zeroed() -> MaybeUninit<T> {
[INFO] [stderr]     |     ^^^^^^^^^^^^^^^^^^^^^^^^^^^^^^^^^^^^^^^
[INFO] [stderr] help: there is an associated function `uninit` with a similar name
[INFO] [stderr]     |
[INFO] [stderr] 47  -         let mut x = MaybeUninit::uninit_array();
[INFO] [stderr] 47  +         let mut x = MaybeUninit::uninit();
[INFO] [stderr]     |
[INFO] [stderr] 
[INFO] [stderr] error[E0599]: no function or associated item named `uninit_array` found for union `MaybeUninit` in the current scope
[INFO] [stderr]    --> /opt/rustwide/cargo-home/registry/src/index.crates.io-1949cf8c6b5b557f/option_trait-0.1.16/src/maybe_cell.rs:59:34
[INFO] [stderr]     |
[INFO] [stderr] 59  |         let mut x = MaybeUninit::uninit_array();
[INFO] [stderr]     |                                  ^^^^^^^^^^^^ function or associated item not found in `MaybeUninit<_>`
[INFO] [stderr]     |
[INFO] [stderr] note: if you're trying to build a new `MaybeUninit<_>` consider using one of the following associated functions:
[INFO] [stderr]       MaybeUninit::<T>::new
[INFO] [stderr]       MaybeUninit::<T>::uninit
[INFO] [stderr]       MaybeUninit::<T>::zeroed
[INFO] [stderr]    --> /opt/rustwide/rustup-home/toolchains/nightly-x86_64-unknown-linux-gnu/lib/rustlib/src/rust/library/core/src/mem/maybe_uninit.rs:307:5
[INFO] [stderr]     |
[INFO] [stderr] 307 |     pub const fn new(val: T) -> MaybeUninit<T> {
[INFO] [stderr]     |     ^^^^^^^^^^^^^^^^^^^^^^^^^^^^^^^^^^^^^^^^^^
[INFO] [stderr] ...
[INFO] [stderr] 330 |     pub const fn uninit() -> MaybeUninit<T> {
[INFO] [stderr]     |     ^^^^^^^^^^^^^^^^^^^^^^^^^^^^^^^^^^^^^^^
[INFO] [stderr] ...
[INFO] [stderr] 380 |     pub const fn zeroed() -> MaybeUninit<T> {
[INFO] [stderr]     |     ^^^^^^^^^^^^^^^^^^^^^^^^^^^^^^^^^^^^^^^
[INFO] [stderr] help: there is an associated function `uninit` with a similar name
[INFO] [stderr]     |
[INFO] [stderr] 59  -         let mut x = MaybeUninit::uninit_array();
[INFO] [stderr] 59  +         let mut x = MaybeUninit::uninit();
[INFO] [stderr]     |
[INFO] [stderr] 
[INFO] [stderr] error[E0277]: the trait bound `F: [const] FnOnce()` is not satisfied
[INFO] [stderr]   --> /opt/rustwide/cargo-home/registry/src/index.crates.io-1949cf8c6b5b557f/option_trait-0.1.16/src/static_maybe.rs:59:9
[INFO] [stderr]    |
[INFO] [stderr] 59 |         func()
[INFO] [stderr]    |         ^^^^
[INFO] [stderr] 
[INFO] [stderr] error[E0277]: the trait bound `M: [const] FnOnce()` is not satisfied
[INFO] [stderr]   --> /opt/rustwide/cargo-home/registry/src/index.crates.io-1949cf8c6b5b557f/option_trait-0.1.16/src/static_maybe.rs:67:9
[INFO] [stderr]    |
[INFO] [stderr] 67 |         maybe()
[INFO] [stderr]    |         ^^^^^
[INFO] [stderr] 
[INFO] [stderr] error[E0277]: the trait bound `O: [const] FnOnce()` is not satisfied
[INFO] [stderr]    --> /opt/rustwide/cargo-home/registry/src/index.crates.io-1949cf8c6b5b557f/option_trait-0.1.16/src/static_maybe.rs:110:9
[INFO] [stderr]     |
[INFO] [stderr] 110 |         or()
[INFO] [stderr]     |         ^^
[INFO] [stderr] 
[INFO] [stderr] error[E0277]: the trait bound `O: [const] FnOnce()` is not satisfied
[INFO] [stderr]    --> /opt/rustwide/cargo-home/registry/src/index.crates.io-1949cf8c6b5b557f/option_trait-0.1.16/src/static_maybe.rs:151:9
[INFO] [stderr]     |
[INFO] [stderr] 151 |         or()
[INFO] [stderr]     |         ^^
[INFO] [stderr] 
[INFO] [stderr] error[E0277]: the trait bound `M: [const] FnOnce()` is not satisfied
[INFO] [stderr]    --> /opt/rustwide/cargo-home/registry/src/index.crates.io-1949cf8c6b5b557f/option_trait-0.1.16/src/static_maybe.rs:194:9
[INFO] [stderr]     |
[INFO] [stderr] 194 |         maybe()
[INFO] [stderr]     |         ^^^^^
[INFO] [stderr] 
[INFO] [stderr] error[E0277]: the trait bound `O: [const] FnOnce()` is not satisfied
[INFO] [stderr]    --> /opt/rustwide/cargo-home/registry/src/index.crates.io-1949cf8c6b5b557f/option_trait-0.1.16/src/static_maybe.rs:237:9
[INFO] [stderr]     |
[INFO] [stderr] 237 |         or()
[INFO] [stderr]     |         ^^
[INFO] [stderr] 
[INFO] [stderr] error[E0015]: cannot call non-const associated function `<<<F as FnOnce<(Some,)>>::Output as static_maybe::StaticMaybe<<F as FnOnce<(Some,)>>::Output>>::Some as static_maybe::StaticMaybe<<F as FnOnce<(Some,)>>::Output>>::maybe_from_fn::<{closure@/opt/rustwide/cargo-home/registry/src/index.crates.io-1949cf8c6b5b557f/option_trait-0.1.16/src/static_maybe.rs:77:36: 77:38}>` in constant functions
[INFO] [stderr]   --> /opt/rustwide/cargo-home/registry/src/index.crates.io-1949cf8c6b5b557f/option_trait-0.1.16/src/static_maybe.rs:77:9
[INFO] [stderr]    |
[INFO] [stderr] 77 |         StaticMaybe::maybe_from_fn(|| map(self))
[INFO] [stderr]    |         ^^^^^^^^^^^^^^^^^^^^^^^^^^^^^^^^^^^^^^^^
[INFO] [stderr]    |
[INFO] [stderr]    = note: calls in constant functions are limited to constant functions, tuple structs and tuple variants
[INFO] [stderr] 
[INFO] [stderr] error[E0493]: destructor of `F` cannot be evaluated at compile-time
[INFO] [stderr]    --> /opt/rustwide/cargo-home/registry/src/index.crates.io-1949cf8c6b5b557f/option_trait-0.1.16/src/static_maybe.rs:97:25
[INFO] [stderr]     |
[INFO] [stderr] 97  |     fn maybe_from_fn<F>(_func: F) -> Self
[INFO] [stderr]     |                         ^^^^^ the destructor for this type cannot be evaluated in constant functions
[INFO] [stderr] ...
[INFO] [stderr] 103 |     }
[INFO] [stderr]     |     - value is dropped here
[INFO] [stderr] 
[INFO] [stderr] error[E0015]: cannot call non-const associated function `<<<F as FnOnce<(Some,)>>::Output as static_maybe::StaticMaybe<<F as FnOnce<(Some,)>>::Output>>::None as static_maybe::StaticMaybe<<F as FnOnce<(Some,)>>::Output>>::maybe_from_fn::<{closure@/opt/rustwide/cargo-home/registry/src/index.crates.io-1949cf8c6b5b557f/option_trait-0.1.16/src/static_maybe.rs:120:36: 120:38}>` in constant functions
[INFO] [stderr]    --> /opt/rustwide/cargo-home/registry/src/index.crates.io-1949cf8c6b5b557f/option_trait-0.1.16/src/static_maybe.rs:120:9
[INFO] [stderr]     |
[INFO] [stderr] 120 |         StaticMaybe::maybe_from_fn(|| panic!())
[INFO] [stderr]     |         ^^^^^^^^^^^^^^^^^^^^^^^^^^^^^^^^^^^^^^^
[INFO] [stderr]     |
[INFO] [stderr]     = note: calls in constant functions are limited to constant functions, tuple structs and tuple variants
[INFO] [stderr] 
[INFO] [stderr] error[E0493]: destructor of `F` cannot be evaluated at compile-time
[INFO] [stderr]    --> /opt/rustwide/cargo-home/registry/src/index.crates.io-1949cf8c6b5b557f/option_trait-0.1.16/src/static_maybe.rs:113:27
[INFO] [stderr]     |
[INFO] [stderr] 113 |     fn maybe_map<F>(self, _: F) -> Self::Maybe<F::Output>
[INFO] [stderr]     |                           ^ the destructor for this type cannot be evaluated in constant functions
[INFO] [stderr] ...
[INFO] [stderr] 121 |     }
[INFO] [stderr]     |     - value is dropped here
[INFO] [stderr] 
[INFO] [stderr] error[E0493]: destructor of `F` cannot be evaluated at compile-time
[INFO] [stderr]    --> /opt/rustwide/cargo-home/registry/src/index.crates.io-1949cf8c6b5b557f/option_trait-0.1.16/src/static_maybe.rs:138:25
[INFO] [stderr]     |
[INFO] [stderr] 138 |     fn maybe_from_fn<F>(_func: F) -> Self
[INFO] [stderr]     |                         ^^^^^ the destructor for this type cannot be evaluated in constant functions
[INFO] [stderr] ...
[INFO] [stderr] 144 |     }
[INFO] [stderr]     |     - value is dropped here
[INFO] [stderr] 
[INFO] [stderr] error[E0015]: cannot call non-const associated function `<<<F as FnOnce<((),)>>::Output as static_maybe::StaticMaybe<<F as FnOnce<((),)>>::Output>>::None as static_maybe::StaticMaybe<<F as FnOnce<((),)>>::Output>>::maybe_from_fn::<{closure@/opt/rustwide/cargo-home/registry/src/index.crates.io-1949cf8c6b5b557f/option_trait-0.1.16/src/static_maybe.rs:161:36: 161:38}>` in constant functions
[INFO] [stderr]    --> /opt/rustwide/cargo-home/registry/src/index.crates.io-1949cf8c6b5b557f/option_trait-0.1.16/src/static_maybe.rs:161:9
[INFO] [stderr]     |
[INFO] [stderr] 161 |         StaticMaybe::maybe_from_fn(|| map(self))
[INFO] [stderr]     |         ^^^^^^^^^^^^^^^^^^^^^^^^^^^^^^^^^^^^^^^^
[INFO] [stderr]     |
[INFO] [stderr]     = note: calls in constant functions are limited to constant functions, tuple structs and tuple variants
[INFO] [stderr] 
[INFO] [stderr] error[E0015]: cannot call non-const associated function `maybe_cell::MaybeCell::<Some, true>::from_fn::<F>` in constant functions
[INFO] [stderr]    --> /opt/rustwide/cargo-home/registry/src/index.crates.io-1949cf8c6b5b557f/option_trait-0.1.16/src/static_maybe.rs:186:9
[INFO] [stderr]     |
[INFO] [stderr] 186 |         Self::from_fn(func)
[INFO] [stderr]     |         ^^^^^^^^^^^^^^^^^^^
[INFO] [stderr]     |
[INFO] [stderr]     = note: calls in constant functions are limited to constant functions, tuple structs and tuple variants
[INFO] [stderr] 
[INFO] [stderr] error[E0015]: cannot call non-const associated function `<<<F as FnOnce<(Some,)>>::Output as static_maybe::StaticMaybe<<F as FnOnce<(Some,)>>::Output>>::Some as static_maybe::StaticMaybe<<F as FnOnce<(Some,)>>::Output>>::maybe_from_fn::<{closure@/opt/rustwide/cargo-home/registry/src/index.crates.io-1949cf8c6b5b557f/option_trait-0.1.16/src/static_maybe.rs:204:36: 204:38}>` in constant functions
[INFO] [stderr]    --> /opt/rustwide/cargo-home/registry/src/index.crates.io-1949cf8c6b5b557f/option_trait-0.1.16/src/static_maybe.rs:204:9
[INFO] [stderr]     |
[INFO] [stderr] 204 |         StaticMaybe::maybe_from_fn(|| map(self.into_value()))
[INFO] [stderr]     |         ^^^^^^^^^^^^^^^^^^^^^^^^^^^^^^^^^^^^^^^^^^^^^^^^^^^^^
[INFO] [stderr]     |
[INFO] [stderr]     = note: calls in constant functions are limited to constant functions, tuple structs and tuple variants
[INFO] [stderr] 
[INFO] [stderr] error[E0015]: cannot call non-const associated function `maybe_cell::MaybeCell::<Some, false>::from_fn::<F>` in constant functions
[INFO] [stderr]    --> /opt/rustwide/cargo-home/registry/src/index.crates.io-1949cf8c6b5b557f/option_trait-0.1.16/src/static_maybe.rs:229:9
[INFO] [stderr]     |
[INFO] [stderr] 229 |         Self::from_fn(func)
[INFO] [stderr]     |         ^^^^^^^^^^^^^^^^^^^
[INFO] [stderr]     |
[INFO] [stderr]     = note: calls in constant functions are limited to constant functions, tuple structs and tuple variants
[INFO] [stderr] 
[INFO] [stderr] error[E0015]: cannot call non-const associated function `<<<F as FnOnce<(Some,)>>::Output as static_maybe::StaticMaybe<<F as FnOnce<(Some,)>>::Output>>::None as static_maybe::StaticMaybe<<F as FnOnce<(Some,)>>::Output>>::maybe_from_fn::<{closure@/opt/rustwide/cargo-home/registry/src/index.crates.io-1949cf8c6b5b557f/option_trait-0.1.16/src/static_maybe.rs:247:36: 247:38}>` in constant functions
[INFO] [stderr]    --> /opt/rustwide/cargo-home/registry/src/index.crates.io-1949cf8c6b5b557f/option_trait-0.1.16/src/static_maybe.rs:247:9
[INFO] [stderr]     |
[INFO] [stderr] 247 |         StaticMaybe::maybe_from_fn(|| panic!())
[INFO] [stderr]     |         ^^^^^^^^^^^^^^^^^^^^^^^^^^^^^^^^^^^^^^^
[INFO] [stderr]     |
[INFO] [stderr]     = note: calls in constant functions are limited to constant functions, tuple structs and tuple variants
[INFO] [stderr] 
[INFO] [stderr] error[E0493]: destructor of `F` cannot be evaluated at compile-time
[INFO] [stderr]    --> /opt/rustwide/cargo-home/registry/src/index.crates.io-1949cf8c6b5b557f/option_trait-0.1.16/src/static_maybe.rs:240:27
[INFO] [stderr]     |
[INFO] [stderr] 240 |     fn maybe_map<F>(self, _: F) -> Self::Maybe<F::Output>
[INFO] [stderr]     |                           ^ the destructor for this type cannot be evaluated in constant functions
[INFO] [stderr] ...
[INFO] [stderr] 248 |     }
[INFO] [stderr]     |     - value is dropped here
[INFO] [stderr] 
[INFO] [stderr] Some errors have detailed explanations: E0015, E0277, E0493, E0599, E0635, E0658.
[INFO] [stderr] For more information about an error, try `rustc --explain E0015`.
[INFO] [stderr] error: could not compile `option_trait` (lib) due to 31 previous errors
[INFO] [stderr] warning: build failed, waiting for other jobs to finish...
[INFO] [stderr] error[E0635]: unknown feature `maybe_uninit_uninit_array`
[INFO] [stderr]  --> /opt/rustwide/cargo-home/registry/src/index.crates.io-1949cf8c6b5b557f/array__ops-0.1.20/src/lib.rs:9:12
[INFO] [stderr]   |
[INFO] [stderr] 9 | #![feature(maybe_uninit_uninit_array)]
[INFO] [stderr]   |            ^^^^^^^^^^^^^^^^^^^^^^^^^
[INFO] [stderr] 
[INFO] [stderr] error[E0284]: type annotations needed: cannot satisfy `<Self as IntoIterator>::Item == [T; N]`
[INFO] [stderr]  --> /opt/rustwide/cargo-home/registry/src/index.crates.io-1949cf8c6b5b557f/array__ops-0.1.20/src/array_2d_ops.rs:6:58
[INFO] [stderr]   |
[INFO] [stderr] 6 | pub trait Array2dOps<T, const M: usize, const N: usize>: ArrayOps<[T; N], M>
[INFO] [stderr]   |                                                          ^^^^^^^^^^^^^^^^^^^ cannot satisfy `<Self as IntoIterator>::Item == [T; N]`
[INFO] [stderr]   |
[INFO] [stderr] note: required by a bound in `array_ops::ArrayOps`
[INFO] [stderr]  --> /opt/rustwide/cargo-home/registry/src/index.crates.io-1949cf8c6b5b557f/array__ops-0.1.20/src/array_ops.rs:9:61
[INFO] [stderr]   |
[INFO] [stderr] 9 | pub trait ArrayOps<T, const N: usize>: Array + IntoIterator<Item = T>
[INFO] [stderr]   |                                                             ^^^^^^^^ required by this bound in `ArrayOps`
[INFO] [stderr] 
[INFO] [stderr] error[E0220]: associated type `ItemNd` not found for `array_trait::ArrayNd`
[INFO] [stderr]  --> /opt/rustwide/cargo-home/registry/src/index.crates.io-1949cf8c6b5b557f/array__ops-0.1.20/src/array_nd_ops.rs:8:77
[INFO] [stderr]   |
[INFO] [stderr] 8 | pub trait ArrayNdOps<const D: usize, T, const L: usize>: Array + ArrayNd<D, ItemNd = T, /*FLAT_LENGTH = {L}*/>
[INFO] [stderr]   |                                                                             ^^^^^^ help: there is an associated type with a similar name: `ElemNd`
[INFO] [stderr] 
[INFO] [stderr] error[E0277]: the trait bound `ArrayBase<OwnedRepr<T>, Dim<[usize; 2]>>: EigVals` is not satisfied
[INFO] [stderr]     --> /opt/rustwide/cargo-home/registry/src/index.crates.io-1949cf8c6b5b557f/slice_math-0.1.31/src/slice_math_.rs:1546:42
[INFO] [stderr]      |
[INFO] [stderr] 1546 |         let mut roots = EigVals::eigvals(&c).unwrap();
[INFO] [stderr]      |                         ---------------- ^^ the trait `EigVals` is not implemented for `ArrayBase<OwnedRepr<T>, Dim<[usize; 2]>>`
[INFO] [stderr]      |                         |
[INFO] [stderr]      |                         required by a bound introduced by this call
[INFO] [stderr]      |
[INFO] [stderr]      = help: the trait `EigVals` is implemented for `ndarray::ArrayBase<S, ndarray::dimension::dim::Dim<[usize; 2]>>`
[INFO] [stderr] 
[INFO] [stderr] error[E0277]: the trait bound `ArrayBase<OwnedRepr<T>, Dim<[usize; 2]>>: EigVals` is not satisfied
[INFO] [stderr]     --> /opt/rustwide/cargo-home/registry/src/index.crates.io-1949cf8c6b5b557f/slice_math-0.1.31/src/slice_math_.rs:1546:25
[INFO] [stderr]      |
[INFO] [stderr] 1546 |         let mut roots = EigVals::eigvals(&c).unwrap();
[INFO] [stderr]      |                         ^^^^^^^^^^^^^^^^^^^^ the trait `EigVals` is not implemented for `ArrayBase<OwnedRepr<T>, Dim<[usize; 2]>>`
[INFO] [stderr]      |
[INFO] [stderr]      = help: the trait `EigVals` is implemented for `ndarray::ArrayBase<S, ndarray::dimension::dim::Dim<[usize; 2]>>`
[INFO] [stderr] 
[INFO] [stderr] error[E0277]: the trait bound `ArrayBase<OwnedRepr<T>, Dim<[usize; 2]>>: EigVals` is not satisfied
[INFO] [stderr]     --> /opt/rustwide/cargo-home/registry/src/index.crates.io-1949cf8c6b5b557f/slice_math-0.1.31/src/slice_math_.rs:1587:42
[INFO] [stderr]      |
[INFO] [stderr] 1587 |         let mut roots = EigVals::eigvals(&c).unwrap();
[INFO] [stderr]      |                         ---------------- ^^ the trait `EigVals` is not implemented for `ArrayBase<OwnedRepr<T>, Dim<[usize; 2]>>`
[INFO] [stderr]      |                         |
[INFO] [stderr]      |                         required by a bound introduced by this call
[INFO] [stderr]      |
[INFO] [stderr]      = help: the trait `EigVals` is implemented for `ndarray::ArrayBase<S, ndarray::dimension::dim::Dim<[usize; 2]>>`
[INFO] [stderr] 
[INFO] [stderr] error[E0277]: the trait bound `ArrayBase<OwnedRepr<T>, Dim<[usize; 2]>>: EigVals` is not satisfied
[INFO] [stderr]     --> /opt/rustwide/cargo-home/registry/src/index.crates.io-1949cf8c6b5b557f/slice_math-0.1.31/src/slice_math_.rs:1587:25
[INFO] [stderr]      |
[INFO] [stderr] 1587 |         let mut roots = EigVals::eigvals(&c).unwrap();
[INFO] [stderr]      |                         ^^^^^^^^^^^^^^^^^^^^ the trait `EigVals` is not implemented for `ArrayBase<OwnedRepr<T>, Dim<[usize; 2]>>`
[INFO] [stderr]      |
[INFO] [stderr]      = help: the trait `EigVals` is implemented for `ndarray::ArrayBase<S, ndarray::dimension::dim::Dim<[usize; 2]>>`
[INFO] [stderr] 
[INFO] [stderr] error[E0599]: no method named `qr` found for struct `ArrayBase` in the current scope
[INFO] [stderr]     --> /opt/rustwide/cargo-home/registry/src/index.crates.io-1949cf8c6b5b557f/slice_math-0.1.31/src/slice_math_.rs:1655:24
[INFO] [stderr]      |
[INFO] [stderr] 1655 |         let (q, r) = v.qr()
[INFO] [stderr]      |                        ^^ method not found in `ArrayBase<OwnedRepr<T>, Dim<[usize; 2]>>`
[INFO] [stderr] 
[INFO] [stderr] error[E0284]: type annotations needed: cannot satisfy `<Self as IntoIterator>::Item == T`
[INFO] [stderr]   |
[INFO] [stderr] note: required by a bound in `array_ops::ArrayOps`
[INFO] [stderr]  --> /opt/rustwide/cargo-home/registry/src/index.crates.io-1949cf8c6b5b557f/array__ops-0.1.20/src/array_ops.rs:9:61
[INFO] [stderr]   |
[INFO] [stderr] 9 | pub trait ArrayOps<T, const N: usize>: Array + IntoIterator<Item = T>
[INFO] [stderr]   |                                                             ^^^^^^^^ required by this bound in `ArrayOps`
[INFO] [stderr] 
[INFO] [stderr] error[E0284]: type annotations needed: cannot satisfy `<Self as IntoIterator>::Item == Simd<T, M>`
[INFO] [stderr]  --> /opt/rustwide/cargo-home/registry/src/index.crates.io-1949cf8c6b5b557f/array__ops-0.1.20/src/array_simd_ops.rs:5:60
[INFO] [stderr]   |
[INFO] [stderr] 5 | pub trait ArraySimdOps<T, const N: usize, const M: usize>: ArrayOps<Simd<T, M>, N>
[INFO] [stderr]   |                                                            ^^^^^^^^^^^^^^^^^^^^^^^ cannot satisfy `<Self as IntoIterator>::Item == Simd<T, M>`
[INFO] [stderr]   |
[INFO] [stderr] note: required by a bound in `array_ops::ArrayOps`
[INFO] [stderr]  --> /opt/rustwide/cargo-home/registry/src/index.crates.io-1949cf8c6b5b557f/array__ops-0.1.20/src/array_ops.rs:9:61
[INFO] [stderr]   |
[INFO] [stderr] 9 | pub trait ArrayOps<T, const N: usize>: Array + IntoIterator<Item = T>
[INFO] [stderr]   |                                                             ^^^^^^^^ required by this bound in `ArrayOps`
[INFO] [stderr] 
[INFO] [stderr] Some errors have detailed explanations: E0277, E0599.
[INFO] [stderr] For more information about an error, try `rustc --explain E0277`.
[INFO] [stderr] error: could not compile `slice_math` (lib) due to 5 previous errors
[INFO] [stderr] error[E0599]: no function or associated item named `uninit_array` found for union `MaybeUninit` in the current scope
[INFO] [stderr]    --> /opt/rustwide/cargo-home/registry/src/index.crates.io-1949cf8c6b5b557f/array__ops-0.1.20/src/array_nd_ops.rs:348:111
[INFO] [stderr]     |
[INFO] [stderr] 348 |                       unsafe {private::transmute_unchecked_size(MaybeUninit::<nd!{MaybeUninit<T>; $($($b)+)?}>::uninit_array::<$a>())};
[INFO] [stderr]     |                                                                                                                 ^^^^^^^^^^^^ function or associated item not found in `MaybeUninit<[[[[[[[[[[[[[[[[...; _16]; _15]; _14]; _13]; _12]; _11]; _10]; _9]; _8]; _7]; _6]; _5]; _4]; _3]; _2]; _1]>`
[INFO] [stderr] ...
[INFO] [stderr] 454 | /     impl_nd_array!(
[INFO] [stderr] 455 | |         _0 _1 _2 _3 _4 _5 _6 _7 _8 _9 _10 _11 _12 _13 _14 _15 _16
[INFO] [stderr] 456 | |     );
[INFO] [stderr]     | |_____- in this macro invocation
[INFO] [stderr]     |
[INFO] [stderr] note: if you're trying to build a new `std::mem::MaybeUninit<[[[[[[[[[[[[[[[[std::mem::MaybeUninit<T>; _16]; _15]; _14]; _13]; _12]; _11]; _10]; _9]; _8]; _7]; _6]; _5]; _4]; _3]; _2]; _1]>` consider using one of the following associated functions:
[INFO] [stderr]       std::mem::MaybeUninit::<T>::new
[INFO] [stderr]       std::mem::MaybeUninit::<T>::uninit
[INFO] [stderr]       std::mem::MaybeUninit::<T>::zeroed
[INFO] [stderr]    --> /opt/rustwide/rustup-home/toolchains/nightly-x86_64-unknown-linux-gnu/lib/rustlib/src/rust/library/core/src/mem/maybe_uninit.rs:307:5
[INFO] [stderr]     |
[INFO] [stderr] 307 |     pub const fn new(val: T) -> MaybeUninit<T> {
[INFO] [stderr]     |     ^^^^^^^^^^^^^^^^^^^^^^^^^^^^^^^^^^^^^^^^^^
[INFO] [stderr] ...
[INFO] [stderr] 330 |     pub const fn uninit() -> MaybeUninit<T> {
[INFO] [stderr]     |     ^^^^^^^^^^^^^^^^^^^^^^^^^^^^^^^^^^^^^^^
[INFO] [stderr] ...
[INFO] [stderr] 380 |     pub const fn zeroed() -> MaybeUninit<T> {
[INFO] [stderr]     |     ^^^^^^^^^^^^^^^^^^^^^^^^^^^^^^^^^^^^^^^
[INFO] [stderr]     = note: this error originates in the macro `impl_nd_array` (in Nightly builds, run with -Z macro-backtrace for more info)
[INFO] [stderr] 
[INFO] [stderr] error[E0599]: no function or associated item named `uninit_array` found for union `MaybeUninit` in the current scope
[INFO] [stderr]    --> /opt/rustwide/cargo-home/registry/src/index.crates.io-1949cf8c6b5b557f/array__ops-0.1.20/src/array_nd_ops.rs:348:111
[INFO] [stderr]     |
[INFO] [stderr] 348 |                       unsafe {private::transmute_unchecked_size(MaybeUninit::<nd!{MaybeUninit<T>; $($($b)+)?}>::uninit_array::<$a>())};
[INFO] [stderr]     |                                                                                                                 ^^^^^^^^^^^^ function or associated item not found in `MaybeUninit<[[[[[[[[[[[[[[[...; _16]; _15]; _14]; _13]; _12]; _11]; _10]; _9]; _8]; _7]; _6]; _5]; _4]; _3]; _2]>`
[INFO] [stderr] ...
[INFO] [stderr] 454 | /     impl_nd_array!(
[INFO] [stderr] 455 | |         _0 _1 _2 _3 _4 _5 _6 _7 _8 _9 _10 _11 _12 _13 _14 _15 _16
[INFO] [stderr] 456 | |     );
[INFO] [stderr]     | |_____- in this macro invocation
[INFO] [stderr]     |
[INFO] [stderr] note: if you're trying to build a new `std::mem::MaybeUninit<[[[[[[[[[[[[[[[std::mem::MaybeUninit<T>; _16]; _15]; _14]; _13]; _12]; _11]; _10]; _9]; _8]; _7]; _6]; _5]; _4]; _3]; _2]>` consider using one of the following associated functions:
[INFO] [stderr]       std::mem::MaybeUninit::<T>::new
[INFO] [stderr]       std::mem::MaybeUninit::<T>::uninit
[INFO] [stderr]       std::mem::MaybeUninit::<T>::zeroed
[INFO] [stderr]    --> /opt/rustwide/rustup-home/toolchains/nightly-x86_64-unknown-linux-gnu/lib/rustlib/src/rust/library/core/src/mem/maybe_uninit.rs:307:5
[INFO] [stderr]     |
[INFO] [stderr] 307 |     pub const fn new(val: T) -> MaybeUninit<T> {
[INFO] [stderr]     |     ^^^^^^^^^^^^^^^^^^^^^^^^^^^^^^^^^^^^^^^^^^
[INFO] [stderr] ...
[INFO] [stderr] 330 |     pub const fn uninit() -> MaybeUninit<T> {
[INFO] [stderr]     |     ^^^^^^^^^^^^^^^^^^^^^^^^^^^^^^^^^^^^^^^
[INFO] [stderr] ...
[INFO] [stderr] 380 |     pub const fn zeroed() -> MaybeUninit<T> {
[INFO] [stderr]     |     ^^^^^^^^^^^^^^^^^^^^^^^^^^^^^^^^^^^^^^^
[INFO] [stderr]     = note: this error originates in the macro `impl_nd_array` (in Nightly builds, run with -Z macro-backtrace for more info)
[INFO] [stderr] 
[INFO] [stderr] error[E0599]: no function or associated item named `uninit_array` found for union `MaybeUninit` in the current scope
[INFO] [stderr]    --> /opt/rustwide/cargo-home/registry/src/index.crates.io-1949cf8c6b5b557f/array__ops-0.1.20/src/array_nd_ops.rs:348:111
[INFO] [stderr]     |
[INFO] [stderr] 348 |                       unsafe {private::transmute_unchecked_size(MaybeUninit::<nd!{MaybeUninit<T>; $($($b)+)?}>::uninit_array::<$a>())};
[INFO] [stderr]     |                                                                                                                 ^^^^^^^^^^^^ function or associated item not found in `MaybeUninit<[[[[[[[[[[[[[[...; _16]; _15]; _14]; _13]; _12]; _11]; _10]; _9]; _8]; _7]; _6]; _5]; _4]; _3]>`
[INFO] [stderr] ...
[INFO] [stderr] 454 | /     impl_nd_array!(
[INFO] [stderr] 455 | |         _0 _1 _2 _3 _4 _5 _6 _7 _8 _9 _10 _11 _12 _13 _14 _15 _16
[INFO] [stderr] 456 | |     );
[INFO] [stderr]     | |_____- in this macro invocation
[INFO] [stderr]     |
[INFO] [stderr] note: if you're trying to build a new `std::mem::MaybeUninit<[[[[[[[[[[[[[[std::mem::MaybeUninit<T>; _16]; _15]; _14]; _13]; _12]; _11]; _10]; _9]; _8]; _7]; _6]; _5]; _4]; _3]>` consider using one of the following associated functions:
[INFO] [stderr]       std::mem::MaybeUninit::<T>::new
[INFO] [stderr]       std::mem::MaybeUninit::<T>::uninit
[INFO] [stderr]       std::mem::MaybeUninit::<T>::zeroed
[INFO] [stderr]    --> /opt/rustwide/rustup-home/toolchains/nightly-x86_64-unknown-linux-gnu/lib/rustlib/src/rust/library/core/src/mem/maybe_uninit.rs:307:5
[INFO] [stderr]     |
[INFO] [stderr] 307 |     pub const fn new(val: T) -> MaybeUninit<T> {
[INFO] [stderr]     |     ^^^^^^^^^^^^^^^^^^^^^^^^^^^^^^^^^^^^^^^^^^
[INFO] [stderr] ...
[INFO] [stderr] 330 |     pub const fn uninit() -> MaybeUninit<T> {
[INFO] [stderr]     |     ^^^^^^^^^^^^^^^^^^^^^^^^^^^^^^^^^^^^^^^
[INFO] [stderr] ...
[INFO] [stderr] 380 |     pub const fn zeroed() -> MaybeUninit<T> {
[INFO] [stderr]     |     ^^^^^^^^^^^^^^^^^^^^^^^^^^^^^^^^^^^^^^^
[INFO] [stderr]     = note: this error originates in the macro `impl_nd_array` (in Nightly builds, run with -Z macro-backtrace for more info)
[INFO] [stderr] 
[INFO] [stderr] error[E0599]: no function or associated item named `uninit_array` found for union `MaybeUninit` in the current scope
[INFO] [stderr]    --> /opt/rustwide/cargo-home/registry/src/index.crates.io-1949cf8c6b5b557f/array__ops-0.1.20/src/array_nd_ops.rs:348:111
[INFO] [stderr]     |
[INFO] [stderr] 348 |                       unsafe {private::transmute_unchecked_size(MaybeUninit::<nd!{MaybeUninit<T>; $($($b)+)?}>::uninit_array::<$a>())};
[INFO] [stderr]     |                                                                                                                 ^^^^^^^^^^^^ function or associated item not found in `MaybeUninit<[[[[[[[[[[[[[...; _16]; _15]; _14]; _13]; _12]; _11]; _10]; _9]; _8]; _7]; _6]; _5]; _4]>`
[INFO] [stderr] ...
[INFO] [stderr] 454 | /     impl_nd_array!(
[INFO] [stderr] 455 | |         _0 _1 _2 _3 _4 _5 _6 _7 _8 _9 _10 _11 _12 _13 _14 _15 _16
[INFO] [stderr] 456 | |     );
[INFO] [stderr]     | |_____- in this macro invocation
[INFO] [stderr]     |
[INFO] [stderr] note: if you're trying to build a new `std::mem::MaybeUninit<[[[[[[[[[[[[[std::mem::MaybeUninit<T>; _16]; _15]; _14]; _13]; _12]; _11]; _10]; _9]; _8]; _7]; _6]; _5]; _4]>` consider using one of the following associated functions:
[INFO] [stderr]       std::mem::MaybeUninit::<T>::new
[INFO] [stderr]       std::mem::MaybeUninit::<T>::uninit
[INFO] [stderr]       std::mem::MaybeUninit::<T>::zeroed
[INFO] [stderr]    --> /opt/rustwide/rustup-home/toolchains/nightly-x86_64-unknown-linux-gnu/lib/rustlib/src/rust/library/core/src/mem/maybe_uninit.rs:307:5
[INFO] [stderr]     |
[INFO] [stderr] 307 |     pub const fn new(val: T) -> MaybeUninit<T> {
[INFO] [stderr]     |     ^^^^^^^^^^^^^^^^^^^^^^^^^^^^^^^^^^^^^^^^^^
[INFO] [stderr] ...
[INFO] [stderr] 330 |     pub const fn uninit() -> MaybeUninit<T> {
[INFO] [stderr]     |     ^^^^^^^^^^^^^^^^^^^^^^^^^^^^^^^^^^^^^^^
[INFO] [stderr] ...
[INFO] [stderr] 380 |     pub const fn zeroed() -> MaybeUninit<T> {
[INFO] [stderr]     |     ^^^^^^^^^^^^^^^^^^^^^^^^^^^^^^^^^^^^^^^
[INFO] [stderr]     = note: this error originates in the macro `impl_nd_array` (in Nightly builds, run with -Z macro-backtrace for more info)
[INFO] [stderr] 
[INFO] [stderr] error[E0599]: no function or associated item named `uninit_array` found for union `MaybeUninit` in the current scope
[INFO] [stderr]    --> /opt/rustwide/cargo-home/registry/src/index.crates.io-1949cf8c6b5b557f/array__ops-0.1.20/src/array_nd_ops.rs:348:111
[INFO] [stderr]     |
[INFO] [stderr] 348 |                       unsafe {private::transmute_unchecked_size(MaybeUninit::<nd!{MaybeUninit<T>; $($($b)+)?}>::uninit_array::<$a>())};
[INFO] [stderr]     |                                                                                                                 ^^^^^^^^^^^^ function or associated item not found in `MaybeUninit<[[[[[[[[[[[[...; _16]; _15]; _14]; _13]; _12]; _11]; _10]; _9]; _8]; _7]; _6]; _5]>`
[INFO] [stderr] ...
[INFO] [stderr] 454 | /     impl_nd_array!(
[INFO] [stderr] 455 | |         _0 _1 _2 _3 _4 _5 _6 _7 _8 _9 _10 _11 _12 _13 _14 _15 _16
[INFO] [stderr] 456 | |     );
[INFO] [stderr]     | |_____- in this macro invocation
[INFO] [stderr]     |
[INFO] [stderr] note: if you're trying to build a new `std::mem::MaybeUninit<[[[[[[[[[[[[std::mem::MaybeUninit<T>; _16]; _15]; _14]; _13]; _12]; _11]; _10]; _9]; _8]; _7]; _6]; _5]>` consider using one of the following associated functions:
[INFO] [stderr]       std::mem::MaybeUninit::<T>::new
[INFO] [stderr]       std::mem::MaybeUninit::<T>::uninit
[INFO] [stderr]       std::mem::MaybeUninit::<T>::zeroed
[INFO] [stderr]    --> /opt/rustwide/rustup-home/toolchains/nightly-x86_64-unknown-linux-gnu/lib/rustlib/src/rust/library/core/src/mem/maybe_uninit.rs:307:5
[INFO] [stderr]     |
[INFO] [stderr] 307 |     pub const fn new(val: T) -> MaybeUninit<T> {
[INFO] [stderr]     |     ^^^^^^^^^^^^^^^^^^^^^^^^^^^^^^^^^^^^^^^^^^
[INFO] [stderr] ...
[INFO] [stderr] 330 |     pub const fn uninit() -> MaybeUninit<T> {
[INFO] [stderr]     |     ^^^^^^^^^^^^^^^^^^^^^^^^^^^^^^^^^^^^^^^
[INFO] [stderr] ...
[INFO] [stderr] 380 |     pub const fn zeroed() -> MaybeUninit<T> {
[INFO] [stderr]     |     ^^^^^^^^^^^^^^^^^^^^^^^^^^^^^^^^^^^^^^^
[INFO] [stderr]     = note: this error originates in the macro `impl_nd_array` (in Nightly builds, run with -Z macro-backtrace for more info)
[INFO] [stderr] 
[INFO] [stderr] error[E0599]: no function or associated item named `uninit_array` found for union `MaybeUninit` in the current scope
[INFO] [stderr]    --> /opt/rustwide/cargo-home/registry/src/index.crates.io-1949cf8c6b5b557f/array__ops-0.1.20/src/array_nd_ops.rs:348:111
[INFO] [stderr]     |
[INFO] [stderr] 348 |                       unsafe {private::transmute_unchecked_size(MaybeUninit::<nd!{MaybeUninit<T>; $($($b)+)?}>::uninit_array::<$a>())};
[INFO] [stderr]     |                                                                                                                 ^^^^^^^^^^^^ function or associated item not found in `MaybeUninit<[[[[[[[[[[[...; _16]; _15]; _14]; _13]; _12]; _11]; _10]; _9]; _8]; _7]; _6]>`
[INFO] [stderr] ...
[INFO] [stderr] 454 | /     impl_nd_array!(
[INFO] [stderr] 455 | |         _0 _1 _2 _3 _4 _5 _6 _7 _8 _9 _10 _11 _12 _13 _14 _15 _16
[INFO] [stderr] 456 | |     );
[INFO] [stderr]     | |_____- in this macro invocation
[INFO] [stderr]     |
[INFO] [stderr] note: if you're trying to build a new `std::mem::MaybeUninit<[[[[[[[[[[[std::mem::MaybeUninit<T>; _16]; _15]; _14]; _13]; _12]; _11]; _10]; _9]; _8]; _7]; _6]>` consider using one of the following associated functions:
[INFO] [stderr]       std::mem::MaybeUninit::<T>::new
[INFO] [stderr]       std::mem::MaybeUninit::<T>::uninit
[INFO] [stderr]       std::mem::MaybeUninit::<T>::zeroed
[INFO] [stderr]    --> /opt/rustwide/rustup-home/toolchains/nightly-x86_64-unknown-linux-gnu/lib/rustlib/src/rust/library/core/src/mem/maybe_uninit.rs:307:5
[INFO] [stderr]     |
[INFO] [stderr] 307 |     pub const fn new(val: T) -> MaybeUninit<T> {
[INFO] [stderr]     |     ^^^^^^^^^^^^^^^^^^^^^^^^^^^^^^^^^^^^^^^^^^
[INFO] [stderr] ...
[INFO] [stderr] 330 |     pub const fn uninit() -> MaybeUninit<T> {
[INFO] [stderr]     |     ^^^^^^^^^^^^^^^^^^^^^^^^^^^^^^^^^^^^^^^
[INFO] [stderr] ...
[INFO] [stderr] 380 |     pub const fn zeroed() -> MaybeUninit<T> {
[INFO] [stderr]     |     ^^^^^^^^^^^^^^^^^^^^^^^^^^^^^^^^^^^^^^^
[INFO] [stderr]     = note: this error originates in the macro `impl_nd_array` (in Nightly builds, run with -Z macro-backtrace for more info)
[INFO] [stderr] 
[INFO] [stderr] error[E0599]: no function or associated item named `uninit_array` found for union `MaybeUninit` in the current scope
[INFO] [stderr]    --> /opt/rustwide/cargo-home/registry/src/index.crates.io-1949cf8c6b5b557f/array__ops-0.1.20/src/array_nd_ops.rs:348:111
[INFO] [stderr]     |
[INFO] [stderr] 348 |                       unsafe {private::transmute_unchecked_size(MaybeUninit::<nd!{MaybeUninit<T>; $($($b)+)?}>::uninit_array::<$a>())};
[INFO] [stderr]     |                                                                                                                 ^^^^^^^^^^^^ function or associated item not found in `MaybeUninit<[[[[[[[[[[...; _16]; _15]; _14]; _13]; _12]; _11]; _10]; _9]; _8]; _7]>`
[INFO] [stderr] ...
[INFO] [stderr] 454 | /     impl_nd_array!(
[INFO] [stderr] 455 | |         _0 _1 _2 _3 _4 _5 _6 _7 _8 _9 _10 _11 _12 _13 _14 _15 _16
[INFO] [stderr] 456 | |     );
[INFO] [stderr]     | |_____- in this macro invocation
[INFO] [stderr]     |
[INFO] [stderr] note: if you're trying to build a new `std::mem::MaybeUninit<[[[[[[[[[[std::mem::MaybeUninit<T>; _16]; _15]; _14]; _13]; _12]; _11]; _10]; _9]; _8]; _7]>` consider using one of the following associated functions:
[INFO] [stderr]       std::mem::MaybeUninit::<T>::new
[INFO] [stderr]       std::mem::MaybeUninit::<T>::uninit
[INFO] [stderr]       std::mem::MaybeUninit::<T>::zeroed
[INFO] [stderr]    --> /opt/rustwide/rustup-home/toolchains/nightly-x86_64-unknown-linux-gnu/lib/rustlib/src/rust/library/core/src/mem/maybe_uninit.rs:307:5
[INFO] [stderr]     |
[INFO] [stderr] 307 |     pub const fn new(val: T) -> MaybeUninit<T> {
[INFO] [stderr]     |     ^^^^^^^^^^^^^^^^^^^^^^^^^^^^^^^^^^^^^^^^^^
[INFO] [stderr] ...
[INFO] [stderr] 330 |     pub const fn uninit() -> MaybeUninit<T> {
[INFO] [stderr]     |     ^^^^^^^^^^^^^^^^^^^^^^^^^^^^^^^^^^^^^^^
[INFO] [stderr] ...
[INFO] [stderr] 380 |     pub const fn zeroed() -> MaybeUninit<T> {
[INFO] [stderr]     |     ^^^^^^^^^^^^^^^^^^^^^^^^^^^^^^^^^^^^^^^
[INFO] [stderr]     = note: this error originates in the macro `impl_nd_array` (in Nightly builds, run with -Z macro-backtrace for more info)
[INFO] [stderr] 
[INFO] [stderr] error[E0599]: no function or associated item named `uninit_array` found for union `MaybeUninit` in the current scope
[INFO] [stderr]    --> /opt/rustwide/cargo-home/registry/src/index.crates.io-1949cf8c6b5b557f/array__ops-0.1.20/src/array_nd_ops.rs:348:111
[INFO] [stderr]     |
[INFO] [stderr] 348 |                       unsafe {private::transmute_unchecked_size(MaybeUninit::<nd!{MaybeUninit<T>; $($($b)+)?}>::uninit_array::<$a>())};
[INFO] [stderr]     |                                                                                                                 ^^^^^^^^^^^^ function or associated item not found in `MaybeUninit<[[[[[[[[[...; _16]; _15]; _14]; _13]; _12]; _11]; _10]; _9]; _8]>`
[INFO] [stderr] ...
[INFO] [stderr] 454 | /     impl_nd_array!(
[INFO] [stderr] 455 | |         _0 _1 _2 _3 _4 _5 _6 _7 _8 _9 _10 _11 _12 _13 _14 _15 _16
[INFO] [stderr] 456 | |     );
[INFO] [stderr]     | |_____- in this macro invocation
[INFO] [stderr]     |
[INFO] [stderr] note: if you're trying to build a new `std::mem::MaybeUninit<[[[[[[[[[std::mem::MaybeUninit<T>; _16]; _15]; _14]; _13]; _12]; _11]; _10]; _9]; _8]>` consider using one of the following associated functions:
[INFO] [stderr]       std::mem::MaybeUninit::<T>::new
[INFO] [stderr]       std::mem::MaybeUninit::<T>::uninit
[INFO] [stderr]       std::mem::MaybeUninit::<T>::zeroed
[INFO] [stderr]    --> /opt/rustwide/rustup-home/toolchains/nightly-x86_64-unknown-linux-gnu/lib/rustlib/src/rust/library/core/src/mem/maybe_uninit.rs:307:5
[INFO] [stderr]     |
[INFO] [stderr] 307 |     pub const fn new(val: T) -> MaybeUninit<T> {
[INFO] [stderr]     |     ^^^^^^^^^^^^^^^^^^^^^^^^^^^^^^^^^^^^^^^^^^
[INFO] [stderr] ...
[INFO] [stderr] 330 |     pub const fn uninit() -> MaybeUninit<T> {
[INFO] [stderr]     |     ^^^^^^^^^^^^^^^^^^^^^^^^^^^^^^^^^^^^^^^
[INFO] [stderr] ...
[INFO] [stderr] 380 |     pub const fn zeroed() -> MaybeUninit<T> {
[INFO] [stderr]     |     ^^^^^^^^^^^^^^^^^^^^^^^^^^^^^^^^^^^^^^^
[INFO] [stderr]     = note: this error originates in the macro `impl_nd_array` (in Nightly builds, run with -Z macro-backtrace for more info)
[INFO] [stderr] 
[INFO] [stderr] error[E0599]: no function or associated item named `uninit_array` found for union `MaybeUninit` in the current scope
[INFO] [stderr]    --> /opt/rustwide/cargo-home/registry/src/index.crates.io-1949cf8c6b5b557f/array__ops-0.1.20/src/array_nd_ops.rs:348:111
[INFO] [stderr]     |
[INFO] [stderr] 348 |                       unsafe {private::transmute_unchecked_size(MaybeUninit::<nd!{MaybeUninit<T>; $($($b)+)?}>::uninit_array::<$a>())};
[INFO] [stderr]     |                                                                                                                 ^^^^^^^^^^^^ function or associated item not found in `MaybeUninit<[[[[[[[[...; _16]; _15]; _14]; _13]; _12]; _11]; _10]; _9]>`
[INFO] [stderr] ...
[INFO] [stderr] 454 | /     impl_nd_array!(
[INFO] [stderr] 455 | |         _0 _1 _2 _3 _4 _5 _6 _7 _8 _9 _10 _11 _12 _13 _14 _15 _16
[INFO] [stderr] 456 | |     );
[INFO] [stderr]     | |_____- in this macro invocation
[INFO] [stderr]     |
[INFO] [stderr] note: if you're trying to build a new `std::mem::MaybeUninit<[[[[[[[[std::mem::MaybeUninit<T>; _16]; _15]; _14]; _13]; _12]; _11]; _10]; _9]>` consider using one of the following associated functions:
[INFO] [stderr]       std::mem::MaybeUninit::<T>::new
[INFO] [stderr]       std::mem::MaybeUninit::<T>::uninit
[INFO] [stderr]       std::mem::MaybeUninit::<T>::zeroed
[INFO] [stderr]    --> /opt/rustwide/rustup-home/toolchains/nightly-x86_64-unknown-linux-gnu/lib/rustlib/src/rust/library/core/src/mem/maybe_uninit.rs:307:5
[INFO] [stderr]     |
[INFO] [stderr] 307 |     pub const fn new(val: T) -> MaybeUninit<T> {
[INFO] [stderr]     |     ^^^^^^^^^^^^^^^^^^^^^^^^^^^^^^^^^^^^^^^^^^
[INFO] [stderr] ...
[INFO] [stderr] 330 |     pub const fn uninit() -> MaybeUninit<T> {
[INFO] [stderr]     |     ^^^^^^^^^^^^^^^^^^^^^^^^^^^^^^^^^^^^^^^
[INFO] [stderr] ...
[INFO] [stderr] 380 |     pub const fn zeroed() -> MaybeUninit<T> {
[INFO] [stderr]     |     ^^^^^^^^^^^^^^^^^^^^^^^^^^^^^^^^^^^^^^^
[INFO] [stderr]     = note: this error originates in the macro `impl_nd_array` (in Nightly builds, run with -Z macro-backtrace for more info)
[INFO] [stderr] 
[INFO] [stderr] error[E0599]: no function or associated item named `uninit_array` found for union `MaybeUninit` in the current scope
[INFO] [stderr]    --> /opt/rustwide/cargo-home/registry/src/index.crates.io-1949cf8c6b5b557f/array__ops-0.1.20/src/array_nd_ops.rs:348:111
[INFO] [stderr]     |
[INFO] [stderr] 348 |                       unsafe {private::transmute_unchecked_size(MaybeUninit::<nd!{MaybeUninit<T>; $($($b)+)?}>::uninit_array::<$a>())};
[INFO] [stderr]     |                                                                                                                 ^^^^^^^^^^^^ function or associated item not found in `MaybeUninit<[[[[[[[...; _16]; _15]; _14]; _13]; _12]; _11]; _10]>`
[INFO] [stderr] ...
[INFO] [stderr] 454 | /     impl_nd_array!(
[INFO] [stderr] 455 | |         _0 _1 _2 _3 _4 _5 _6 _7 _8 _9 _10 _11 _12 _13 _14 _15 _16
[INFO] [stderr] 456 | |     );
[INFO] [stderr]     | |_____- in this macro invocation
[INFO] [stderr]     |
[INFO] [stderr] note: if you're trying to build a new `std::mem::MaybeUninit<[[[[[[[std::mem::MaybeUninit<T>; _16]; _15]; _14]; _13]; _12]; _11]; _10]>` consider using one of the following associated functions:
[INFO] [stderr]       std::mem::MaybeUninit::<T>::new
[INFO] [stderr]       std::mem::MaybeUninit::<T>::uninit
[INFO] [stderr]       std::mem::MaybeUninit::<T>::zeroed
[INFO] [stderr]    --> /opt/rustwide/rustup-home/toolchains/nightly-x86_64-unknown-linux-gnu/lib/rustlib/src/rust/library/core/src/mem/maybe_uninit.rs:307:5
[INFO] [stderr]     |
[INFO] [stderr] 307 |     pub const fn new(val: T) -> MaybeUninit<T> {
[INFO] [stderr]     |     ^^^^^^^^^^^^^^^^^^^^^^^^^^^^^^^^^^^^^^^^^^
[INFO] [stderr] ...
[INFO] [stderr] 330 |     pub const fn uninit() -> MaybeUninit<T> {
[INFO] [stderr]     |     ^^^^^^^^^^^^^^^^^^^^^^^^^^^^^^^^^^^^^^^
[INFO] [stderr] ...
[INFO] [stderr] 380 |     pub const fn zeroed() -> MaybeUninit<T> {
[INFO] [stderr]     |     ^^^^^^^^^^^^^^^^^^^^^^^^^^^^^^^^^^^^^^^
[INFO] [stderr]     = note: this error originates in the macro `impl_nd_array` (in Nightly builds, run with -Z macro-backtrace for more info)
[INFO] [stderr] 
[INFO] [stderr] error[E0599]: no function or associated item named `uninit_array` found for union `std::mem::MaybeUninit` in the current scope
[INFO] [stderr]    --> /opt/rustwide/cargo-home/registry/src/index.crates.io-1949cf8c6b5b557f/array__ops-0.1.20/src/array_nd_ops.rs:348:111
[INFO] [stderr]     |
[INFO] [stderr] 348 |                       unsafe {private::transmute_unchecked_size(MaybeUninit::<nd!{MaybeUninit<T>; $($($b)+)?}>::uninit_array::<$a>())};
[INFO] [stderr]     |                                                                                                                 ^^^^^^^^^^^^ function or associated item not found in `std::mem::MaybeUninit<[[[[[[std::mem::MaybeUninit<T>; _16]; _15]; _14]; _13]; _12]; _11]>`
[INFO] [stderr] ...
[INFO] [stderr] 454 | /     impl_nd_array!(
[INFO] [stderr] 455 | |         _0 _1 _2 _3 _4 _5 _6 _7 _8 _9 _10 _11 _12 _13 _14 _15 _16
[INFO] [stderr] 456 | |     );
[INFO] [stderr]     | |_____- in this macro invocation
[INFO] [stderr]     |
[INFO] [stderr] note: if you're trying to build a new `std::mem::MaybeUninit<[[[[[[std::mem::MaybeUninit<T>; _16]; _15]; _14]; _13]; _12]; _11]>` consider using one of the following associated functions:
[INFO] [stderr]       std::mem::MaybeUninit::<T>::new
[INFO] [stderr]       std::mem::MaybeUninit::<T>::uninit
[INFO] [stderr]       std::mem::MaybeUninit::<T>::zeroed
[INFO] [stderr]    --> /opt/rustwide/rustup-home/toolchains/nightly-x86_64-unknown-linux-gnu/lib/rustlib/src/rust/library/core/src/mem/maybe_uninit.rs:307:5
[INFO] [stderr]     |
[INFO] [stderr] 307 |     pub const fn new(val: T) -> MaybeUninit<T> {
[INFO] [stderr]     |     ^^^^^^^^^^^^^^^^^^^^^^^^^^^^^^^^^^^^^^^^^^
[INFO] [stderr] ...
[INFO] [stderr] 330 |     pub const fn uninit() -> MaybeUninit<T> {
[INFO] [stderr]     |     ^^^^^^^^^^^^^^^^^^^^^^^^^^^^^^^^^^^^^^^
[INFO] [stderr] ...
[INFO] [stderr] 380 |     pub const fn zeroed() -> MaybeUninit<T> {
[INFO] [stderr]     |     ^^^^^^^^^^^^^^^^^^^^^^^^^^^^^^^^^^^^^^^
[INFO] [stderr]     = note: this error originates in the macro `impl_nd_array` (in Nightly builds, run with -Z macro-backtrace for more info)
[INFO] [stderr] 
[INFO] [stderr] error[E0599]: no function or associated item named `uninit_array` found for union `std::mem::MaybeUninit` in the current scope
[INFO] [stderr]    --> /opt/rustwide/cargo-home/registry/src/index.crates.io-1949cf8c6b5b557f/array__ops-0.1.20/src/array_nd_ops.rs:348:111
[INFO] [stderr]     |
[INFO] [stderr] 348 |                       unsafe {private::transmute_unchecked_size(MaybeUninit::<nd!{MaybeUninit<T>; $($($b)+)?}>::uninit_array::<$a>())};
[INFO] [stderr]     |                                                                                                                 ^^^^^^^^^^^^ function or associated item not found in `std::mem::MaybeUninit<[[[[[std::mem::MaybeUninit<T>; _16]; _15]; _14]; _13]; _12]>`
[INFO] [stderr] ...
[INFO] [stderr] 454 | /     impl_nd_array!(
[INFO] [stderr] 455 | |         _0 _1 _2 _3 _4 _5 _6 _7 _8 _9 _10 _11 _12 _13 _14 _15 _16
[INFO] [stderr] 456 | |     );
[INFO] [stderr]     | |_____- in this macro invocation
[INFO] [stderr]     |
[INFO] [stderr] note: if you're trying to build a new `std::mem::MaybeUninit<[[[[[std::mem::MaybeUninit<T>; _16]; _15]; _14]; _13]; _12]>` consider using one of the following associated functions:
[INFO] [stderr]       std::mem::MaybeUninit::<T>::new
[INFO] [stderr]       std::mem::MaybeUninit::<T>::uninit
[INFO] [stderr]       std::mem::MaybeUninit::<T>::zeroed
[INFO] [stderr]    --> /opt/rustwide/rustup-home/toolchains/nightly-x86_64-unknown-linux-gnu/lib/rustlib/src/rust/library/core/src/mem/maybe_uninit.rs:307:5
[INFO] [stderr]     |
[INFO] [stderr] 307 |     pub const fn new(val: T) -> MaybeUninit<T> {
[INFO] [stderr]     |     ^^^^^^^^^^^^^^^^^^^^^^^^^^^^^^^^^^^^^^^^^^
[INFO] [stderr] ...
[INFO] [stderr] 330 |     pub const fn uninit() -> MaybeUninit<T> {
[INFO] [stderr]     |     ^^^^^^^^^^^^^^^^^^^^^^^^^^^^^^^^^^^^^^^
[INFO] [stderr] ...
[INFO] [stderr] 380 |     pub const fn zeroed() -> MaybeUninit<T> {
[INFO] [stderr]     |     ^^^^^^^^^^^^^^^^^^^^^^^^^^^^^^^^^^^^^^^
[INFO] [stderr]     = note: this error originates in the macro `impl_nd_array` (in Nightly builds, run with -Z macro-backtrace for more info)
[INFO] [stderr] 
[INFO] [stderr] error[E0599]: no function or associated item named `uninit_array` found for union `std::mem::MaybeUninit` in the current scope
[INFO] [stderr]    --> /opt/rustwide/cargo-home/registry/src/index.crates.io-1949cf8c6b5b557f/array__ops-0.1.20/src/array_nd_ops.rs:348:111
[INFO] [stderr]     |
[INFO] [stderr] 348 |                       unsafe {private::transmute_unchecked_size(MaybeUninit::<nd!{MaybeUninit<T>; $($($b)+)?}>::uninit_array::<$a>())};
[INFO] [stderr]     |                                                                                                                 ^^^^^^^^^^^^ function or associated item not found in `std::mem::MaybeUninit<[[[[std::mem::MaybeUninit<T>; _16]; _15]; _14]; _13]>`
[INFO] [stderr] ...
[INFO] [stderr] 454 | /     impl_nd_array!(
[INFO] [stderr] 455 | |         _0 _1 _2 _3 _4 _5 _6 _7 _8 _9 _10 _11 _12 _13 _14 _15 _16
[INFO] [stderr] 456 | |     );
[INFO] [stderr]     | |_____- in this macro invocation
[INFO] [stderr]     |
[INFO] [stderr] note: if you're trying to build a new `std::mem::MaybeUninit<[[[[std::mem::MaybeUninit<T>; _16]; _15]; _14]; _13]>` consider using one of the following associated functions:
[INFO] [stderr]       std::mem::MaybeUninit::<T>::new
[INFO] [stderr]       std::mem::MaybeUninit::<T>::uninit
[INFO] [stderr]       std::mem::MaybeUninit::<T>::zeroed
[INFO] [stderr]    --> /opt/rustwide/rustup-home/toolchains/nightly-x86_64-unknown-linux-gnu/lib/rustlib/src/rust/library/core/src/mem/maybe_uninit.rs:307:5
[INFO] [stderr]     |
[INFO] [stderr] 307 |     pub const fn new(val: T) -> MaybeUninit<T> {
[INFO] [stderr]     |     ^^^^^^^^^^^^^^^^^^^^^^^^^^^^^^^^^^^^^^^^^^
[INFO] [stderr] ...
[INFO] [stderr] 330 |     pub const fn uninit() -> MaybeUninit<T> {
[INFO] [stderr]     |     ^^^^^^^^^^^^^^^^^^^^^^^^^^^^^^^^^^^^^^^
[INFO] [stderr] ...
[INFO] [stderr] 380 |     pub const fn zeroed() -> MaybeUninit<T> {
[INFO] [stderr]     |     ^^^^^^^^^^^^^^^^^^^^^^^^^^^^^^^^^^^^^^^
[INFO] [stderr]     = note: this error originates in the macro `impl_nd_array` (in Nightly builds, run with -Z macro-backtrace for more info)
[INFO] [stderr] 
[INFO] [stderr] error[E0599]: no function or associated item named `uninit_array` found for union `std::mem::MaybeUninit` in the current scope
[INFO] [stderr]    --> /opt/rustwide/cargo-home/registry/src/index.crates.io-1949cf8c6b5b557f/array__ops-0.1.20/src/array_nd_ops.rs:348:111
[INFO] [stderr]     |
[INFO] [stderr] 348 |                       unsafe {private::transmute_unchecked_size(MaybeUninit::<nd!{MaybeUninit<T>; $($($b)+)?}>::uninit_array::<$a>())};
[INFO] [stderr]     |                                                                                                                 ^^^^^^^^^^^^ function or associated item not found in `std::mem::MaybeUninit<[[[std::mem::MaybeUninit<T>; _16]; _15]; _14]>`
[INFO] [stderr] ...
[INFO] [stderr] 454 | /     impl_nd_array!(
[INFO] [stderr] 455 | |         _0 _1 _2 _3 _4 _5 _6 _7 _8 _9 _10 _11 _12 _13 _14 _15 _16
[INFO] [stderr] 456 | |     );
[INFO] [stderr]     | |_____- in this macro invocation
[INFO] [stderr]     |
[INFO] [stderr] note: if you're trying to build a new `std::mem::MaybeUninit<[[[std::mem::MaybeUninit<T>; _16]; _15]; _14]>` consider using one of the following associated functions:
[INFO] [stderr]       std::mem::MaybeUninit::<T>::new
[INFO] [stderr]       std::mem::MaybeUninit::<T>::uninit
[INFO] [stderr]       std::mem::MaybeUninit::<T>::zeroed
[INFO] [stderr]    --> /opt/rustwide/rustup-home/toolchains/nightly-x86_64-unknown-linux-gnu/lib/rustlib/src/rust/library/core/src/mem/maybe_uninit.rs:307:5
[INFO] [stderr]     |
[INFO] [stderr] 307 |     pub const fn new(val: T) -> MaybeUninit<T> {
[INFO] [stderr]     |     ^^^^^^^^^^^^^^^^^^^^^^^^^^^^^^^^^^^^^^^^^^
[INFO] [stderr] ...
[INFO] [stderr] 330 |     pub const fn uninit() -> MaybeUninit<T> {
[INFO] [stderr]     |     ^^^^^^^^^^^^^^^^^^^^^^^^^^^^^^^^^^^^^^^
[INFO] [stderr] ...
[INFO] [stderr] 380 |     pub const fn zeroed() -> MaybeUninit<T> {
[INFO] [stderr]     |     ^^^^^^^^^^^^^^^^^^^^^^^^^^^^^^^^^^^^^^^
[INFO] [stderr]     = note: this error originates in the macro `impl_nd_array` (in Nightly builds, run with -Z macro-backtrace for more info)
[INFO] [stderr] 
[INFO] [stderr] error[E0599]: no function or associated item named `uninit_array` found for union `std::mem::MaybeUninit` in the current scope
[INFO] [stderr]    --> /opt/rustwide/cargo-home/registry/src/index.crates.io-1949cf8c6b5b557f/array__ops-0.1.20/src/array_nd_ops.rs:348:111
[INFO] [stderr]     |
[INFO] [stderr] 348 |                       unsafe {private::transmute_unchecked_size(MaybeUninit::<nd!{MaybeUninit<T>; $($($b)+)?}>::uninit_array::<$a>())};
[INFO] [stderr]     |                                                                                                                 ^^^^^^^^^^^^ function or associated item not found in `std::mem::MaybeUninit<[[std::mem::MaybeUninit<T>; _16]; _15]>`
[INFO] [stderr] ...
[INFO] [stderr] 454 | /     impl_nd_array!(
[INFO] [stderr] 455 | |         _0 _1 _2 _3 _4 _5 _6 _7 _8 _9 _10 _11 _12 _13 _14 _15 _16
[INFO] [stderr] 456 | |     );
[INFO] [stderr]     | |_____- in this macro invocation
[INFO] [stderr]     |
[INFO] [stderr] note: if you're trying to build a new `std::mem::MaybeUninit<[[std::mem::MaybeUninit<T>; _16]; _15]>` consider using one of the following associated functions:
[INFO] [stderr]       std::mem::MaybeUninit::<T>::new
[INFO] [stderr]       std::mem::MaybeUninit::<T>::uninit
[INFO] [stderr]       std::mem::MaybeUninit::<T>::zeroed
[INFO] [stderr]    --> /opt/rustwide/rustup-home/toolchains/nightly-x86_64-unknown-linux-gnu/lib/rustlib/src/rust/library/core/src/mem/maybe_uninit.rs:307:5
[INFO] [stderr]     |
[INFO] [stderr] 307 |     pub const fn new(val: T) -> MaybeUninit<T> {
[INFO] [stderr]     |     ^^^^^^^^^^^^^^^^^^^^^^^^^^^^^^^^^^^^^^^^^^
[INFO] [stderr] ...
[INFO] [stderr] 330 |     pub const fn uninit() -> MaybeUninit<T> {
[INFO] [stderr]     |     ^^^^^^^^^^^^^^^^^^^^^^^^^^^^^^^^^^^^^^^
[INFO] [stderr] ...
[INFO] [stderr] 380 |     pub const fn zeroed() -> MaybeUninit<T> {
[INFO] [stderr]     |     ^^^^^^^^^^^^^^^^^^^^^^^^^^^^^^^^^^^^^^^
[INFO] [stderr]     = note: this error originates in the macro `impl_nd_array` (in Nightly builds, run with -Z macro-backtrace for more info)
[INFO] [stderr] 
[INFO] [stderr] error[E0599]: no function or associated item named `uninit_array` found for union `std::mem::MaybeUninit` in the current scope
[INFO] [stderr]    --> /opt/rustwide/cargo-home/registry/src/index.crates.io-1949cf8c6b5b557f/array__ops-0.1.20/src/array_nd_ops.rs:348:111
[INFO] [stderr]     |
[INFO] [stderr] 348 |                       unsafe {private::transmute_unchecked_size(MaybeUninit::<nd!{MaybeUninit<T>; $($($b)+)?}>::uninit_array::<$a>())};
[INFO] [stderr]     |                                                                                                                 ^^^^^^^^^^^^ function or associated item not found in `std::mem::MaybeUninit<[std::mem::MaybeUninit<T>; _16]>`
[INFO] [stderr] ...
[INFO] [stderr] 454 | /     impl_nd_array!(
[INFO] [stderr] 455 | |         _0 _1 _2 _3 _4 _5 _6 _7 _8 _9 _10 _11 _12 _13 _14 _15 _16
[INFO] [stderr] 456 | |     );
[INFO] [stderr]     | |_____- in this macro invocation
[INFO] [stderr]     |
[INFO] [stderr] note: if you're trying to build a new `std::mem::MaybeUninit<[std::mem::MaybeUninit<T>; _16]>` consider using one of the following associated functions:
[INFO] [stderr]       std::mem::MaybeUninit::<T>::new
[INFO] [stderr]       std::mem::MaybeUninit::<T>::uninit
[INFO] [stderr]       std::mem::MaybeUninit::<T>::zeroed
[INFO] [stderr]    --> /opt/rustwide/rustup-home/toolchains/nightly-x86_64-unknown-linux-gnu/lib/rustlib/src/rust/library/core/src/mem/maybe_uninit.rs:307:5
[INFO] [stderr]     |
[INFO] [stderr] 307 |     pub const fn new(val: T) -> MaybeUninit<T> {
[INFO] [stderr]     |     ^^^^^^^^^^^^^^^^^^^^^^^^^^^^^^^^^^^^^^^^^^
[INFO] [stderr] ...
[INFO] [stderr] 330 |     pub const fn uninit() -> MaybeUninit<T> {
[INFO] [stderr]     |     ^^^^^^^^^^^^^^^^^^^^^^^^^^^^^^^^^^^^^^^
[INFO] [stderr] ...
[INFO] [stderr] 380 |     pub const fn zeroed() -> MaybeUninit<T> {
[INFO] [stderr]     |     ^^^^^^^^^^^^^^^^^^^^^^^^^^^^^^^^^^^^^^^
[INFO] [stderr]     = note: this error originates in the macro `impl_nd_array` (in Nightly builds, run with -Z macro-backtrace for more info)
[INFO] [stderr] 
[INFO] [stderr] error[E0599]: no function or associated item named `uninit_array` found for union `std::mem::MaybeUninit` in the current scope
[INFO] [stderr]    --> /opt/rustwide/cargo-home/registry/src/index.crates.io-1949cf8c6b5b557f/array__ops-0.1.20/src/array_nd_ops.rs:348:111
[INFO] [stderr]     |
[INFO] [stderr] 348 |                       unsafe {private::transmute_unchecked_size(MaybeUninit::<nd!{MaybeUninit<T>; $($($b)+)?}>::uninit_array::<$a>())};
[INFO] [stderr]     |                                                                                                                 ^^^^^^^^^^^^ function or associated item not found in `std::mem::MaybeUninit<std::mem::MaybeUninit<T>>`
[INFO] [stderr] ...
[INFO] [stderr] 454 | /     impl_nd_array!(
[INFO] [stderr] 455 | |         _0 _1 _2 _3 _4 _5 _6 _7 _8 _9 _10 _11 _12 _13 _14 _15 _16
[INFO] [stderr] 456 | |     );
[INFO] [stderr]     | |_____- in this macro invocation
[INFO] [stderr]     |
[INFO] [stderr] note: if you're trying to build a new `std::mem::MaybeUninit<std::mem::MaybeUninit<T>>` consider using one of the following associated functions:
[INFO] [stderr]       std::mem::MaybeUninit::<T>::new
[INFO] [stderr]       std::mem::MaybeUninit::<T>::uninit
[INFO] [stderr]       std::mem::MaybeUninit::<T>::zeroed
[INFO] [stderr]    --> /opt/rustwide/rustup-home/toolchains/nightly-x86_64-unknown-linux-gnu/lib/rustlib/src/rust/library/core/src/mem/maybe_uninit.rs:307:5
[INFO] [stderr]     |
[INFO] [stderr] 307 |     pub const fn new(val: T) -> MaybeUninit<T> {
[INFO] [stderr]     |     ^^^^^^^^^^^^^^^^^^^^^^^^^^^^^^^^^^^^^^^^^^
[INFO] [stderr] ...
[INFO] [stderr] 330 |     pub const fn uninit() -> MaybeUninit<T> {
[INFO] [stderr]     |     ^^^^^^^^^^^^^^^^^^^^^^^^^^^^^^^^^^^^^^^
[INFO] [stderr] ...
[INFO] [stderr] 380 |     pub const fn zeroed() -> MaybeUninit<T> {
[INFO] [stderr]     |     ^^^^^^^^^^^^^^^^^^^^^^^^^^^^^^^^^^^^^^^
[INFO] [stderr]     = note: this error originates in the macro `impl_nd_array` (in Nightly builds, run with -Z macro-backtrace for more info)
[INFO] [stderr] 
[INFO] [stderr] error[E0599]: no function or associated item named `uninit_array` found for union `std::mem::MaybeUninit` in the current scope
[INFO] [stderr]     --> /opt/rustwide/cargo-home/registry/src/index.crates.io-1949cf8c6b5b557f/array__ops-0.1.20/src/array_ops.rs:1601:38
[INFO] [stderr]      |
[INFO] [stderr] 1601 |         let mut array = MaybeUninit::uninit_array();
[INFO] [stderr]      |                                      ^^^^^^^^^^^^ function or associated item not found in `std::mem::MaybeUninit<_>`
[INFO] [stderr]      |
[INFO] [stderr] note: if you're trying to build a new `std::mem::MaybeUninit<_>` consider using one of the following associated functions:
[INFO] [stderr]       std::mem::MaybeUninit::<T>::new
[INFO] [stderr]       std::mem::MaybeUninit::<T>::uninit
[INFO] [stderr]       std::mem::MaybeUninit::<T>::zeroed
[INFO] [stderr]     --> /opt/rustwide/rustup-home/toolchains/nightly-x86_64-unknown-linux-gnu/lib/rustlib/src/rust/library/core/src/mem/maybe_uninit.rs:307:5
[INFO] [stderr]      |
[INFO] [stderr] 307  |     pub const fn new(val: T) -> MaybeUninit<T> {
[INFO] [stderr]      |     ^^^^^^^^^^^^^^^^^^^^^^^^^^^^^^^^^^^^^^^^^^
[INFO] [stderr] ...
[INFO] [stderr] 330  |     pub const fn uninit() -> MaybeUninit<T> {
[INFO] [stderr]      |     ^^^^^^^^^^^^^^^^^^^^^^^^^^^^^^^^^^^^^^^
[INFO] [stderr] ...
[INFO] [stderr] 380  |     pub const fn zeroed() -> MaybeUninit<T> {
[INFO] [stderr]      |     ^^^^^^^^^^^^^^^^^^^^^^^^^^^^^^^^^^^^^^^
[INFO] [stderr] help: there is an associated function `uninit` with a similar name
[INFO] [stderr]      |
[INFO] [stderr] 1601 -         let mut array = MaybeUninit::uninit_array();
[INFO] [stderr] 1601 +         let mut array = MaybeUninit::uninit();
[INFO] [stderr]      |
[INFO] [stderr] 
[INFO] [stderr] error[E0599]: no function or associated item named `uninit_array` found for union `std::mem::MaybeUninit` in the current scope
[INFO] [stderr]     --> /opt/rustwide/cargo-home/registry/src/index.crates.io-1949cf8c6b5b557f/array__ops-0.1.20/src/array_ops.rs:1614:38
[INFO] [stderr]      |
[INFO] [stderr] 1614 |         let mut array = MaybeUninit::uninit_array();
[INFO] [stderr]      |                                      ^^^^^^^^^^^^ function or associated item not found in `std::mem::MaybeUninit<_>`
[INFO] [stderr]      |
[INFO] [stderr] note: if you're trying to build a new `std::mem::MaybeUninit<_>` consider using one of the following associated functions:
[INFO] [stderr]       std::mem::MaybeUninit::<T>::new
[INFO] [stderr]       std::mem::MaybeUninit::<T>::uninit
[INFO] [stderr]       std::mem::MaybeUninit::<T>::zeroed
[INFO] [stderr]     --> /opt/rustwide/rustup-home/toolchains/nightly-x86_64-unknown-linux-gnu/lib/rustlib/src/rust/library/core/src/mem/maybe_uninit.rs:307:5
[INFO] [stderr]      |
[INFO] [stderr] 307  |     pub const fn new(val: T) -> MaybeUninit<T> {
[INFO] [stderr]      |     ^^^^^^^^^^^^^^^^^^^^^^^^^^^^^^^^^^^^^^^^^^
[INFO] [stderr] ...
[INFO] [stderr] 330  |     pub const fn uninit() -> MaybeUninit<T> {
[INFO] [stderr]      |     ^^^^^^^^^^^^^^^^^^^^^^^^^^^^^^^^^^^^^^^
[INFO] [stderr] ...
[INFO] [stderr] 380  |     pub const fn zeroed() -> MaybeUninit<T> {
[INFO] [stderr]      |     ^^^^^^^^^^^^^^^^^^^^^^^^^^^^^^^^^^^^^^^
[INFO] [stderr] help: there is an associated function `uninit` with a similar name
[INFO] [stderr]      |
[INFO] [stderr] 1614 -         let mut array = MaybeUninit::uninit_array();
[INFO] [stderr] 1614 +         let mut array = MaybeUninit::uninit();
[INFO] [stderr]      |
[INFO] [stderr] 
[INFO] [stderr] Some errors have detailed explanations: E0220, E0284, E0599, E0635.
[INFO] [stderr] For more information about an error, try `rustc --explain E0220`.
[INFO] [stderr] error: could not compile `array__ops` (lib) due to 26 previous errors
[INFO] running `Command { std: "docker" "inspect" "8dce26daec0b2c7807063c4e898b59d30aa12ea3029c6cd969178c587c18ffce", kill_on_drop: false }`
[INFO] running `Command { std: "docker" "rm" "-f" "8dce26daec0b2c7807063c4e898b59d30aa12ea3029c6cd969178c587c18ffce", kill_on_drop: false }`
[INFO] [stdout] 8dce26daec0b2c7807063c4e898b59d30aa12ea3029c6cd969178c587c18ffce