Build failed. If you want to re-trigger a documentation build, you can do it here. You can find more information on docs.rs builds documentation on the builds page.
# rustc version
rustc 1.67.0-nightly (c1a859b25 2022-11-10)# docs.rs version
docsrs 0.6.0 (6685320 2022-11-09)# build log
[INFO] running `Command { std: "docker" "create" "-v" "/home/cratesfyi/workspace/builds/scratchstack-wrapper-aws-c-http-0.1.0-alpha.7/target:/opt/rustwide/target:rw,Z" "-v" "/home/cratesfyi/workspace/builds/scratchstack-wrapper-aws-c-http-0.1.0-alpha.7/source:/opt/rustwide/workdir:ro,Z" "-v" "/home/cratesfyi/workspace/cargo-home:/opt/rustwide/cargo-home:ro,Z" "-v" "/home/cratesfyi/workspace/rustup-home:/opt/rustwide/rustup-home:ro,Z" "-e" "SOURCE_DIR=/opt/rustwide/workdir" "-e" "CARGO_TARGET_DIR=/opt/rustwide/target" "-e" "DOCS_RS=1" "-e" "CARGO_HOME=/opt/rustwide/cargo-home" "-e" "RUSTUP_HOME=/opt/rustwide/rustup-home" "-w" "/opt/rustwide/workdir" "-m" "3221225472" "--cpus" "3" "--user" "1001:1001" "--network" "none" "ghcr.io/rust-lang/crates-build-env/linux@sha256:bb5b0feb4f87116a4ea905b7ff5bf5b85913db05e9f0fbc1abdd3168928d9075" "/opt/rustwide/cargo-home/bin/cargo" "+nightly" "rustdoc" "--lib" "-Zrustdoc-map" "-Z" "unstable-options" "--config" "build.rustdocflags=[\"-Z\", \"unstable-options\", \"--emit=invocation-specific\", \"--resource-suffix\", \"-20221110-1.67.0-nightly-c1a859b25\", \"--static-root-path\", \"/-/rustdoc.static/\", \"--cap-lints\", \"warn\", \"--disable-per-crate-search\", \"--extern-html-root-takes-precedence\"]" "--offline" "-Zunstable-options" "--config=doc.extern-map.registries.crates-io=\"https://docs.rs/{pkg_name}/{version}/x86_64-unknown-linux-gnu\"" "-j3" "--target" "x86_64-unknown-linux-gnu", kill_on_drop: false }`
[INFO] [stderr] WARNING: Your kernel does not support swap limit capabilities or the cgroup is not mounted. Memory limited without swap.
[INFO] [stdout] d14f80d378876c90e8f596b1f29f607a74598ef2241a7c7207f7ec59e264eae8
[INFO] running `Command { std: "docker" "start" "-a" "d14f80d378876c90e8f596b1f29f607a74598ef2241a7c7207f7ec59e264eae8", kill_on_drop: false }`
[INFO] [stderr] Checking scratchstack-wrapper-aws-c-common v0.1.0-alpha.7
[INFO] [stderr] Checking scratchstack-wrapper-aws-lc v0.1.0-alpha.7
[INFO] [stderr] Checking s2n-tls-sys v0.0.18
[INFO] [stderr] Compiling scratchstack-wrapper-aws-c-http v0.1.0-alpha.7 (/opt/rustwide/workdir)
[INFO] [stderr] error[E0412]: cannot find type `__va_list_tag` in this scope
[INFO] [stderr] --> /opt/rustwide/target/x86_64-unknown-linux-gnu/debug/build/scratchstack-wrapper-aws-c-common-ba0b46db1e4ac8af/out/bindings.rs:5425:20
[INFO] [stderr] |
[INFO] [stderr] 5418 | pub type aws_log_formatter_format_fn = ::std::option::Option<
[INFO] [stderr] | - help: you might be missing a type parameter: `<__va_list_tag>`
[INFO] [stderr] ...
[INFO] [stderr] 5425 | args: *mut __va_list_tag,
[INFO] [stderr] | ^^^^^^^^^^^^^ not found in this scope
[INFO] [stderr]
[INFO] [stderr] error[E0412]: cannot find type `__va_list_tag` in this scope
[INFO] [stderr] --> /opt/rustwide/target/x86_64-unknown-linux-gnu/debug/build/scratchstack-wrapper-aws-c-common-ba0b46db1e4ac8af/out/bindings.rs:5712:20
[INFO] [stderr] |
[INFO] [stderr] 5712 | args: *mut __va_list_tag,
[INFO] [stderr] | ^^^^^^^^^^^^^ not found in this scope
[INFO] [stderr]
[INFO] [stderr] error[E0412]: cannot find type `__va_list_tag` in this scope
[INFO] [stderr] --> /opt/rustwide/target/x86_64-unknown-linux-gnu/debug/build/scratchstack-wrapper-aws-lc-df4c6aa6834d5b04/out/bindings.rs:14173:20
[INFO] [stderr] |
[INFO] [stderr] 14173 | args: *mut __va_list_tag,
[INFO] [stderr] | ^^^^^^^^^^^^^ not found in this scope
[INFO] [stderr]
[INFO] [stderr] error[E0283]: type annotations needed
[INFO] [stderr] --> /opt/rustwide/target/x86_64-unknown-linux-gnu/debug/build/scratchstack-wrapper-aws-c-common-ba0b46db1e4ac8af/out/bindings.rs:5433:5
[INFO] [stderr] |
[INFO] [stderr] 5431 | #[derive(Debug, Default, Copy, Clone, PartialEq, Eq)]
[INFO] [stderr] | ------- in this derive macro expansion
[INFO] [stderr] 5432 | pub struct aws_log_formatter_vtable {
[INFO] [stderr] 5433 | pub format: aws_log_formatter_format_fn,
[INFO] [stderr] | ^^^^^^^^^^^^^^^^^^^^^^^^^^^^^^^^^^^^^^^ cannot infer type
[INFO] [stderr] |
[INFO] [stderr] = note: cannot satisfy `_: Default`
[INFO] [stderr] = note: this error originates in the derive macro `Default` (in Nightly builds, run with -Z macro-backtrace for more info)
[INFO] [stderr]
[INFO] [stderr] Some errors have detailed explanations: E0283, E0412.
[INFO] [stderr] For more information about an error, try `rustc --explain E0283`.
[INFO] [stderr] error: could not compile `scratchstack-wrapper-aws-c-common` due to 3 previous errors
[INFO] [stderr] warning: build failed, waiting for other jobs to finish...
[INFO] [stderr] For more information about this error, try `rustc --explain E0412`.
[INFO] [stderr] error: could not compile `scratchstack-wrapper-aws-lc` due to previous error
[INFO] running `Command { std: "docker" "inspect" "d14f80d378876c90e8f596b1f29f607a74598ef2241a7c7207f7ec59e264eae8", kill_on_drop: false }`
[INFO] running `Command { std: "docker" "rm" "-f" "d14f80d378876c90e8f596b1f29f607a74598ef2241a7c7207f7ec59e264eae8", kill_on_drop: false }`
[INFO] [stdout] d14f80d378876c90e8f596b1f29f607a74598ef2241a7c7207f7ec59e264eae8