Build failed. If you want to re-trigger a documentation build, you can do it here. You can find more information on docs.rs builds documentation on the builds page.
# error kind ExecutionFailed
# pre-build errors command failed: exit status: 101
# rustc version rustc 1.101.0-nightly (282215592 2026-10-04)
# docs.rs version docsrs 0.0.0 (0d4d9d0ac4ac345b886b2c0432b69ff103a3c7be 2026-10-05 )
# build log [INFO] adding target x86_64-unknown-linux-gnu for toolchain nightly [INFO] running `"rustup" "target" "add" "--toolchain" "nightly" "x86_64-unknown-linux-gnu"` [INFO] [stderr] info: component rust-std is up to date [INFO] running `"docker" "exec" "-e" "SOURCE_DIR=/opt/rustwide/workdir" "-e" "CARGO_HOME=/opt/rustwide/cargo-home" "-e" "RUSTUP_HOME=/opt/rustwide/rustup-home" "-e" "CARGO_TARGET_DIR=/opt/rustwide/target" "-e" "DOCS_RS=1" "-w" "/opt/rustwide/workdir" "--user" "1001:1001" "d4c469b0a3aed5c23fe08fbac2ed03862b0d508b77e05f12b0c1f8a7405d4a66" "/opt/rustwide/cargo-home/bin/cargo" "+nightly" "rustdoc" "--lib" "-Zrustdoc-map" "--config" "build.rustdocflags=[\"--cfg\", \"docsrs\", \"-Z\", \"unstable-options\", \"--emit=html-non-static-files\", \"--resource-suffix\", \"-20261004-1.101.0-nightly-282215592\", \"--static-root-path\", \"/-/rustdoc.static/\", \"--extern-html-root-takes-precedence\"]" "--offline" "-Zunstable-options" "--config=doc.extern-map.registries.crates-io=\"https://docs.rs/{pkg_name}/{version}/x86_64-unknown-linux-gnu\"" "-j12" "--target" "x86_64-unknown-linux-gnu" "-Zrustdoc-scrape-examples"` [INFO] [stderr] warning: target filter specified, but no targets matched; this is a no-op [INFO] [stderr] Compiling pctx_code_execution_runtime v0.3.0 (/opt/rustwide/workdir) [INFO] [stderr] error: linking with `cc` failed: exit status: 1 [INFO] [stderr] | [INFO] [stderr] = note: "cc" "-m64" "/opt/rustwide/target/debug/build/pctx_code_execution_runtime/03e6ffd24ada46ce/out/rustcatE8PZ/symbols.o" "<58 object files omitted>" "-Wl,--as-needed" "-Wl,-Bstatic" "/opt/rustwide/target/debug/build/rmcp/be8ea220532064df/out/librmcp-be8ea220532064df.rlib" "/opt/rustwide/target/debug/build/reqwest/5a20bd465c1f25f1/out/libreqwest-5a20bd465c1f25f1.rlib" "/opt/rustwide/target/debug/build/rustls-platform-verifier/7a316e531d609089/out/librustls_platform_verifier-7a316e531d609089.rlib" "/opt/rustwide/target/debug/build/rustls-native-certs/8c4e8a3e5f168964/out/librustls_native_certs-8c4e8a3e5f168964.rlib" "/opt/rustwide/target/debug/build/openssl-probe/cbb93053a39143d6/out/libopenssl_probe-cbb93053a39143d6.rlib" "/opt/rustwide/target/debug/build/cookie_store/0c91b0d45d92a280/out/libcookie_store-0c91b0d45d92a280.rlib" "/opt/rustwide/target/debug/build/publicsuffix/bef7e5d1d1c83ee3/out/libpublicsuffix-bef7e5d1d1c83ee3.rlib" "/opt/rustwide/target/debug/build/psl-types/74e8e93c2593dbca/out/libpsl_types-74e8e93c2593dbca.rlib" "/opt/rustwide/target/debug/build/cookie/72959062bc62dc5e/out/libcookie-72959062bc62dc5e.rlib" "/opt/rustwide/target/debug/build/time/2292de0e20b2dc04/out/libtime-2292de0e20b2dc04.rlib" "/opt/rustwide/target/debug/build/powerfmt/9c7ecdb332ca6acd/out/libpowerfmt-9c7ecdb332ca6acd.rlib" "/opt/rustwide/target/debug/build/num-conv/a0dbf6115d9e6437/out/libnum_conv-a0dbf6115d9e6437.rlib" "/opt/rustwide/target/debug/build/deranged/d4d350dfc19f9d9f/out/libderanged-d4d350dfc19f9d9f.rlib" "/opt/rustwide/target/debug/build/time-core/db9d60d6cee726a7/out/libtime_core-db9d60d6cee726a7.rlib" "/opt/rustwide/target/debug/build/hyper-rustls/2943622d8827d0ce/out/libhyper_rustls-2943622d8827d0ce.rlib" "/opt/rustwide/target/debug/build/tokio-rustls/11db1c3cce02ba40/out/libtokio_rustls-11db1c3cce02ba40.rlib" "/opt/rustwide/target/debug/build/rustls/b4593b6d9365d876/out/librustls-b4593b6d9365d876.rlib" "/opt/rustwide/target/debug/build/subtle/a7c30e9150b6c9d8/out/libsubtle-a7c30e9150b6c9d8.rlib" "/opt/rustwide/target/debug/build/rustls-webpki/b037786b568b879c/out/libwebpki-b037786b568b879c.rlib" "/opt/rustwide/target/debug/build/untrusted/9c1a8c0c452596ad/out/libuntrusted-9c1a8c0c452596ad.rlib" "/opt/rustwide/target/debug/build/aws-lc-rs/5489cbb1c7b65cbe/out/libaws_lc_rs-5489cbb1c7b65cbe.rlib" "/opt/rustwide/target/debug/build/aws-lc-sys/6f847d8af19f560e/out/libaws_lc_sys-6f847d8af19f560e.rlib" "/opt/rustwide/target/debug/build/rustls-pki-types/ca519d3f567fcf20/out/librustls_pki_types-ca519d3f567fcf20.rlib" "/opt/rustwide/target/debug/build/zeroize/854e85a0cfb60c6d/out/libzeroize-854e85a0cfb60c6d.rlib" "/opt/rustwide/target/debug/build/mime/daa94d94911c1946/out/libmime-daa94d94911c1946.rlib" "/opt/rustwide/target/debug/build/encoding_rs/5e3745dea57b1d15/out/libencoding_rs-5e3745dea57b1d15.rlib" "/opt/rustwide/target/debug/build/simdutf8/8cdde4c1682c7abe/out/libsimdutf8-8cdde4c1682c7abe.rlib" "/opt/rustwide/target/debug/build/core_detect/6b48fd27f8c74166/out/libcore_detect-6b48fd27f8c74166.rlib" "/opt/rustwide/target/debug/build/tower-http/4af281585b48e7d5/out/libtower_http-4af281585b48e7d5.rlib" "/opt/rustwide/target/debug/build/async-compression/c3397e75a697ff01/out/libasync_compression-c3397e75a697ff01.rlib" "/opt/rustwide/target/debug/build/compression-codecs/2f40c5e06986d599/out/libcompression_codecs-2f40c5e06986d599.rlib" "/opt/rustwide/target/debug/build/zstd/6687a68b29b07299/out/libzstd-6687a68b29b07299.rlib" "/opt/rustwide/target/debug/build/zstd-safe/e47356adf6130fb8/out/libzstd_safe-e47356adf6130fb8.rlib" "/opt/rustwide/target/debug/build/zstd-sys/eb06b8ed3be4fa7c/out/libzstd_sys-eb06b8ed3be4fa7c.rlib" "/opt/rustwide/target/debug/build/flate2/a668ad381226998a/out/libflate2-a668ad381226998a.rlib" "/opt/rustwide/target/debug/build/miniz_oxide/8bb05ed1806cdd0c/out/libminiz_oxide-8bb05ed1806cdd0c.rlib" "/opt/rustwide/target/debug/build/simd-adler32/0c4b0b2d33a292b9/out/libsimd_adler32-0c4b0b2d33a292b9.rlib" "/opt/rustwide/target/debug/build/crc32fast/041a1a288b1bc33f/out/libcrc32fast-041a1a288b1bc33f.rlib" "/opt/rustwide/target/debug/build/brotli/e619ba6091c898e1/out/libbrotli-e619ba6091c898e1.rlib" "/opt/rustwide/target/debug/build/brotli-decompressor/4ee324e3798d95a2/out/libbrotli_decompressor-4ee324e3798d95a2.rlib" "/opt/rustwide/target/debug/build/alloc-stdlib/c477b90abdfcf9b8/out/liballoc_stdlib-c477b90abdfcf9b8.rlib" "/opt/rustwide/target/debug/build/alloc-no-stdlib/ca6ddeeed1779e95/out/liballoc_no_stdlib-ca6ddeeed1779e95.rlib" "/opt/rustwide/target/debug/build/compression-core/a55da5f24ed278a0/out/libcompression_core-a55da5f24ed278a0.rlib" "/opt/rustwide/target/debug/build/tower/bf2cd04f4f69e508/out/libtower-bf2cd04f4f69e508.rlib" "/opt/rustwide/target/debug/build/tower-layer/0e51d86a089d8d0f/out/libtower_layer-0e51d86a089d8d0f.rlib" "/opt/rustwide/target/debug/build/hyper-util/c363a5c5ab09fc63/out/libhyper_util-c363a5c5ab09fc63.rlib" "/opt/rustwide/target/debug/build/base64/88dcd42d4413f954/out/libbase64-88dcd42d4413f954.rlib" "/opt/rustwide/target/debug/build/ipnet/1c9947fa3f6e9493/out/libipnet-1c9947fa3f6e9493.rlib" "/opt/rustwide/target/debug/build/tower-service/7ac5165b203ec039/out/libtower_service-7ac5165b203ec039.rlib" "/opt/rustwide/target/debug/build/hyper/6f0f1ce4e827d120/out/libhyper-6f0f1ce4e827d120.rlib" "/opt/rustwide/target/debug/build/want/497258d560aedc39/out/libwant-497258d560aedc39.rlib" "/opt/rustwide/target/debug/build/try-lock/a3a646dfcf7a7db3/out/libtry_lock-a3a646dfcf7a7db3.rlib" "/opt/rustwide/target/debug/build/httparse/29f471fd7b3b4aa4/out/libhttparse-29f471fd7b3b4aa4.rlib" "/opt/rustwide/target/debug/build/h2/07fdf0fd841b488c/out/libh2-07fdf0fd841b488c.rlib" "/opt/rustwide/target/debug/build/fnv/b4193684a965a7e4/out/libfnv-b4193684a965a7e4.rlib" "/opt/rustwide/target/debug/build/atomic-waker/5d13dc593474e24b/out/libatomic_waker-5d13dc593474e24b.rlib" "/opt/rustwide/target/debug/build/httpdate/2f72c24ab2e189c7/out/libhttpdate-2f72c24ab2e189c7.rlib" "/opt/rustwide/target/debug/build/log/8ac11e934df6aebb/out/liblog-8ac11e934df6aebb.rlib" "/opt/rustwide/target/debug/build/sync_wrapper/6da51a0fcb48cbe4/out/libsync_wrapper-6da51a0fcb48cbe4.rlib" "/opt/rustwide/target/debug/build/sse-stream/4e32bfe48a644fa4/out/libsse_stream-4e32bfe48a644fa4.rlib" "/opt/rustwide/target/debug/build/http-body-util/d359b65f84527dc7/out/libhttp_body_util-d359b65f84527dc7.rlib" "/opt/rustwide/target/debug/build/http-body/3be884d6b2ac6216/out/libhttp_body-3be884d6b2ac6216.rlib" "/opt/rustwide/target/debug/build/http/109e57fafc84d13e/out/libhttp-109e57fafc84d13e.rlib" "/opt/rustwide/target/debug/build/process-wrap/eb0301df2d8f3033/out/libprocess_wrap-eb0301df2d8f3033.rlib" "/opt/rustwide/target/debug/build/nix/266cc266d3784189/out/libnix-266cc266d3784189.rlib" "/opt/rustwide/target/debug/build/tokio-stream/d6ce45da6b20490d/out/libtokio_stream-d6ce45da6b20490d.rlib" "/opt/rustwide/target/debug/build/tracing/95c1b80ed69e9e6f/out/libtracing-95c1b80ed69e9e6f.rlib" "/opt/rustwide/target/debug/build/tracing-core/3b0065075eafbb59/out/libtracing_core-3b0065075eafbb59.rlib" "/opt/rustwide/target/debug/build/once_cell/b1fd511a994cb72e/out/libonce_cell-b1fd511a994cb72e.rlib" "/opt/rustwide/target/debug/build/tokio-util/fa285b64ae508d8b/out/libtokio_util-fa285b64ae508d8b.rlib" "/opt/rustwide/target/debug/build/schemars/8ccf42e29fbeacfa/out/libschemars-8ccf42e29fbeacfa.rlib" "/opt/rustwide/target/debug/build/dyn-clone/4355ab5d15e99189/out/libdyn_clone-4355ab5d15e99189.rlib" "/opt/rustwide/target/debug/build/ref-cast/f7fb21279de1df25/out/libref_cast-f7fb21279de1df25.rlib" "/opt/rustwide/target/debug/build/chrono/790d19ded6320aa2/out/libchrono-790d19ded6320aa2.rlib" "/opt/rustwide/target/debug/build/deno_core/073a12c7f3aa0b18/out/libdeno_core-073a12c7f3aa0b18.rlib" "/opt/rustwide/target/debug/build/deno_core_icudata/249721c98e6f1b55/out/libdeno_core_icudata-249721c98e6f1b55.rlib" "/opt/rustwide/target/debug/build/base64/abef1adde3530447/out/libbase64-abef1adde3530447.rlib" "/opt/rustwide/target/debug/build/static_assertions/b23f9456d08c2faf/out/libstatic_assertions-b23f9456d08c2faf.rlib" "/opt/rustwide/target/debug/build/inventory/3fed714604935395/out/libinventory-3fed714604935395.rlib" "/opt/rustwide/target/debug/build/deno_path_util/068ddba21e066ff4/out/libdeno_path_util-068ddba21e066ff4.rlib" "/opt/rustwide/target/debug/build/sys_traits/3698c5855652f706/out/libsys_traits-3698c5855652f706.rlib" "/opt/rustwide/target/debug/build/anyhow/77b50017bac17420/out/libanyhow-77b50017bac17420.rlib" "/opt/rustwide/target/debug/build/sourcemap/6879736ba37da8dc/out/libsourcemap-6879736ba37da8dc.rlib" "/opt/rustwide/target/debug/build/base64-simd/a64d4260505858a3/out/libbase64_simd-a64d4260505858a3.rlib" "/opt/rustwide/target/debug/build/outref/64feb78a67741ab2/out/liboutref-64feb78a67741ab2.rlib" "/opt/rustwide/target/debug/build/vsimd/a318056eecef51d7/out/libvsimd-a318056eecef51d7.rlib" "/opt/rustwide/target/debug/build/unicode-id-start/7c8c4a9c90862c3c/out/libunicode_id_start-7c8c4a9c90862c3c.rlib" "/opt/rustwide/target/debug/build/data-encoding/a94008fd81b3ee3b/out/libdata_encoding-a94008fd81b3ee3b.rlib" "/opt/rustwide/target/debug/build/if_chain/8ff3d78ee29f1bb6/out/libif_chain-8ff3d78ee29f1bb6.rlib" "/opt/rustwide/target/debug/build/bitvec/03d6447d158dbcd0/out/libbitvec-03d6447d158dbcd0.rlib" "/opt/rustwide/target/debug/build/wyz/01670738a07301dc/out/libwyz-01670738a07301dc.rlib" "/opt/rustwide/target/debug/build/tap/db64676956143bc2/out/libtap-db64676956143bc2.rlib" "/opt/rustwide/target/debug/build/radium/8cf53693178a13e8/out/libradium-8cf53693178a13e8.rlib" "/opt/rustwide/target/debug/build/funty/d622d5d086347b83/out/libfunty-d622d5d086347b83.rlib" "/opt/rustwide/target/debug/build/rustc-hash/4c2a7a0a10340089/out/librustc_hash-4c2a7a0a10340089.rlib" "/opt/rustwide/target/debug/build/debugid/54a846bfe41b512d/out/libdebugid-54a846bfe41b512d.rlib" "/opt/rustwide/target/debug/build/deno_unsync/1cd45ba4c9d61a81/out/libdeno_unsync-1cd45ba4c9d61a81.rlib" "/opt/rustwide/target/debug/build/wasm_dep_analyzer/eb52451df5606e4e/out/libwasm_dep_analyzer-eb52451df5606e4e.rlib" "/opt/rustwide/target/debug/build/serde_v8/0e8cd4ab7fdffebc/out/libserde_v8-0e8cd4ab7fdffebc.rlib" "/opt/rustwide/target/debug/build/num-bigint/7beee614d045ff47/out/libnum_bigint-7beee614d045ff47.rlib" "/opt/rustwide/target/debug/build/num-integer/2aefa93ada0d43b2/out/libnum_integer-2aefa93ada0d43b2.rlib" "/opt/rustwide/target/debug/build/thiserror/882db3372d554b45/out/libthiserror-882db3372d554b45.rlib" "/opt/rustwide/target/debug/build/deno_v8/70b1f61ca814e278/out/libdeno_v8-70b1f61ca814e278.rlib" "/opt/rustwide/target/debug/build/v8/97fbdda7fd1ead4d/out/libv8-97fbdda7fd1ead4d.rlib" "/opt/rustwide/target/debug/build/temporal_capi/0e3800bafb722daf/out/libtemporal_capi-0e3800bafb722daf.rlib" "/opt/rustwide/target/debug/build/diplomat-runtime/37237aa1948ce60a/out/libdiplomat_runtime-37237aa1948ce60a.rlib" "/opt/rustwide/target/debug/build/temporal_rs/f5c981a9e0aa8aee/out/libtemporal_rs-f5c981a9e0aa8aee.rlib" "/opt/rustwide/target/debug/build/icu_calendar/65fa040b854aef9c/out/libicu_calendar-65fa040b854aef9c.rlib" "/opt/rustwide/target/debug/build/icu_locale_fallback/00fff3f3ad3c59a7/out/libicu_locale_fallback-00fff3f3ad3c59a7.rlib" "/opt/rustwide/target/debug/build/icu_locale_fallback_data/c877968bacf93535/out/libicu_locale_fallback_data-c877968bacf93535.rlib" "/opt/rustwide/target/debug/build/icu_calendar_data/604887a4a7098cca/out/libicu_calendar_data-604887a4a7098cca.rlib" "/opt/rustwide/target/debug/build/ixdtf/d589e923ff95855d/out/libixdtf-d589e923ff95855d.rlib" "/opt/rustwide/target/debug/build/num-traits/699fbc5c01d890a7/out/libnum_traits-699fbc5c01d890a7.rlib" "/opt/rustwide/target/debug/build/timezone_provider/cc162d6c84ea6c9c/out/libtimezone_provider-cc162d6c84ea6c9c.rlib" "/opt/rustwide/target/debug/build/zoneinfo64/2f61ab03d2c629a3/out/libzoneinfo64-2f61ab03d2c629a3.rlib" "/opt/rustwide/target/debug/build/resb/d6241a3d5df1f8bf/out/libresb-d6241a3d5df1f8bf.rlib" "/opt/rustwide/target/debug/build/calendrical_calculations/f5dbc2d321a5f6f2/out/libcalendrical_calculations-f5dbc2d321a5f6f2.rlib" "/opt/rustwide/target/debug/build/core_maths/668c73c9c63a42e6/out/libcore_maths-668c73c9c63a42e6.rlib" "/opt/rustwide/target/debug/build/libm/6a6168a96e836451/out/liblibm-6a6168a96e836451.rlib" "/opt/rustwide/target/debug/build/bitflags/21113d36d14db8ae/out/libbitflags-21113d36d14db8ae.rlib" "/opt/rustwide/target/debug/build/uuid/c8751350ac8277e7/out/libuuid-c8751350ac8277e7.rlib" "/opt/rustwide/target/debug/build/getrandom/ef0c5a71ec554ff5/out/libgetrandom-ef0c5a71ec554ff5.rlib" "/opt/rustwide/target/debug/build/pin-project/a45f7bf4f75b8dd2/out/libpin_project-a45f7bf4f75b8dd2.rlib" "/opt/rustwide/target/debug/build/futures/43f8448e6ec69660/out/libfutures-43f8448e6ec69660.rlib" "/opt/rustwide/target/debug/build/futures-executor/f6100523a5cb5e3c/out/libfutures_executor-f6100523a5cb5e3c.rlib" "/opt/rustwide/target/debug/build/futures-util/f82339cbeff7872b/out/libfutures_util-f82339cbeff7872b.rlib" "/opt/rustwide/target/debug/build/futures-io/0c5fb9c24e3485f6/out/libfutures_io-0c5fb9c24e3485f6.rlib" "/opt/rustwide/target/debug/build/slab/57cc2c3cd25b5970/out/libslab-57cc2c3cd25b5970.rlib" "/opt/rustwide/target/debug/build/futures-channel/7fd6ca891b5dcdb0/out/libfutures_channel-7fd6ca891b5dcdb0.rlib" "/opt/rustwide/target/debug/build/futures-sink/8b6a070541d75ca7/out/libfutures_sink-8b6a070541d75ca7.rlib" "/opt/rustwide/target/debug/build/futures-task/66a134ed83e98574/out/libfutures_task-66a134ed83e98574.rlib" "/opt/rustwide/target/debug/build/futures-core/bfb396505dfea036/out/libfutures_core-bfb396505dfea036.rlib" "/opt/rustwide/target/debug/build/deno_error/1c91f7312cc93c09/out/libdeno_error-1c91f7312cc93c09.rlib" "/opt/rustwide/target/debug/build/tokio/2c336df380364fe6/out/libtokio-2c336df380364fe6.rlib" "/opt/rustwide/target/debug/build/signal-hook-registry/415ff285585899af/out/libsignal_hook_registry-415ff285585899af.rlib" "/opt/rustwide/target/debug/build/errno/49f3e62195e93ad7/out/liberrno-49f3e62195e93ad7.rlib" "/opt/rustwide/target/debug/build/socket2/6b30428329bcd7b9/out/libsocket2-6b30428329bcd7b9.rlib" "/opt/rustwide/target/debug/build/bytes/9b0aec4a43eb0886/out/libbytes-9b0aec4a43eb0886.rlib" "/opt/rustwide/target/debug/build/mio/5eabff1cf7a3e566/out/libmio-5eabff1cf7a3e566.rlib" "/opt/rustwide/target/debug/build/pin-project-lite/2ff97dda599ad6f8/out/libpin_project_lite-2ff97dda599ad6f8.rlib" "/opt/rustwide/target/debug/build/url/da7adc00c494e836/out/liburl-da7adc00c494e836.rlib" "/opt/rustwide/target/debug/build/idna/4aa4805637afa9f3/out/libidna-4aa4805637afa9f3.rlib" "/opt/rustwide/target/debug/build/idna_adapter/ef61488cb142d0a0/out/libidna_adapter-ef61488cb142d0a0.rlib" "/opt/rustwide/target/debug/build/icu_properties/b24e42ad76f8ba8c/out/libicu_properties-b24e42ad76f8ba8c.rlib" "/opt/rustwide/target/debug/build/icu_properties_data/2bc91f0f0509883d/out/libicu_properties_data-2bc91f0f0509883d.rlib" "/opt/rustwide/target/debug/build/icu_normalizer/5af47bea962f4896/out/libicu_normalizer-5af47bea962f4896.rlib" "/opt/rustwide/target/debug/build/icu_normalizer_data/0d30c5b5665ef492/out/libicu_normalizer_data-0d30c5b5665ef492.rlib" "/opt/rustwide/target/debug/build/icu_collections/c2aca9fa28bd5630/out/libicu_collections-c2aca9fa28bd5630.rlib" "/opt/rustwide/target/debug/build/utf8_iter/f95c390134f4cbfc/out/libutf8_iter-f95c390134f4cbfc.rlib" "/opt/rustwide/target/debug/build/potential_utf/6d7e7c3eb421ad9d/out/libpotential_utf-6d7e7c3eb421ad9d.rlib" "/opt/rustwide/target/debug/build/icu_provider/ee101dcdfaa0e2d9/out/libicu_provider-ee101dcdfaa0e2d9.rlib" "/opt/rustwide/target/debug/build/icu_locale_core/e4dfce44354616d5/out/libicu_locale_core-e4dfce44354616d5.rlib" "/opt/rustwide/target/debug/build/tinystr/8229f7a5a33e0528/out/libtinystr-8229f7a5a33e0528.rlib" "/opt/rustwide/target/debug/build/litemap/95668f86452d0ab7/out/liblitemap-95668f86452d0ab7.rlib" "/opt/rustwide/target/debug/build/writeable/5f5dea90ac7b6675/out/libwriteable-5f5dea90ac7b6675.rlib" "/opt/rustwide/target/debug/build/zerovec/191f298c926206af/out/libzerovec-191f298c926206af.rlib" "/opt/rustwide/target/debug/build/zerotrie/5bd681325b62929e/out/libzerotrie-5bd681325b62929e.rlib" "/opt/rustwide/target/debug/build/yoke/2e1475af055d4d60/out/libyoke-2e1475af055d4d60.rlib" "/opt/rustwide/target/debug/build/stable_deref_trait/9c74c2f3aaf1bc80/out/libstable_deref_trait-9c74c2f3aaf1bc80.rlib" "/opt/rustwide/target/debug/build/zerofrom/53d3d2b93424b2ef/out/libzerofrom-53d3d2b93424b2ef.rlib" "/opt/rustwide/target/debug/build/form_urlencoded/e1ac12ce1659e85f/out/libform_urlencoded-e1ac12ce1659e85f.rlib" "/opt/rustwide/target/debug/build/percent-encoding/fdb8b4bcafcb590c/out/libpercent_encoding-fdb8b4bcafcb590c.rlib" "/opt/rustwide/target/debug/build/serde_json/52ee2dcf90db3bda/out/libserde_json-52ee2dcf90db3bda.rlib" "/opt/rustwide/target/debug/build/memchr/433ccd1065983af8/out/libmemchr-433ccd1065983af8.rlib" "/opt/rustwide/target/debug/build/zmij/43ee96586801d1be/out/libzmij-43ee96586801d1be.rlib" "/opt/rustwide/target/debug/build/itoa/6a6d3f3d53caa1d6/out/libitoa-6a6d3f3d53caa1d6.rlib" "/opt/rustwide/target/debug/build/indexmap/6b1a60b3d2c82923/out/libindexmap-6b1a60b3d2c82923.rlib" "/opt/rustwide/target/debug/build/equivalent/3ff77df1ac69f53a/out/libequivalent-3ff77df1ac69f53a.rlib" "/opt/rustwide/target/debug/build/hashbrown/1206d3f47ccfca72/out/libhashbrown-1206d3f47ccfca72.rlib" "/opt/rustwide/target/debug/build/serde/6b68396a9f61f9da/out/libserde-6b68396a9f61f9da.rlib" "/opt/rustwide/target/debug/build/serde_core/c18b5074444502b4/out/libserde_core-c18b5074444502b4.rlib" "/opt/rustwide/target/debug/build/parking_lot/5f60ca8dd04e2a3c/out/libparking_lot-5f60ca8dd04e2a3c.rlib" "/opt/rustwide/target/debug/build/parking_lot_core/78c3c3bfe5d9647c/out/libparking_lot_core-78c3c3bfe5d9647c.rlib" "/opt/rustwide/target/debug/build/libc/29ddb25a93edb7e2/out/liblibc-29ddb25a93edb7e2.rlib" "/opt/rustwide/target/debug/build/cfg-if/7f02b23b970d439a/out/libcfg_if-7f02b23b970d439a.rlib" "/opt/rustwide/target/debug/build/smallvec/545b16d99c719ea8/out/libsmallvec-545b16d99c719ea8.rlib" "/opt/rustwide/target/debug/build/lock_api/9fd6913848ac39ce/out/liblock_api-9fd6913848ac39ce.rlib" "/opt/rustwide/target/debug/build/scopeguard/cfa69166bd4da734/out/libscopeguard-cfa69166bd4da734.rlib" "/opt/rustwide/target/debug/build/bit-set/bd5e7e223f2ff372/out/libbit_set-bd5e7e223f2ff372.rlib" "/opt/rustwide/target/debug/build/bit-vec/58a86113f4761c7a/out/libbit_vec-58a86113f4761c7a.rlib" "<sysroot>/lib/rustlib/x86_64-unknown-linux-gnu/lib/{libstd-*,libpanic_unwind-*,libobject-*,libmemchr-*,libaddr2line-*,libgimli-*,libcfg_if-*,librustc_demangle-*,libstd_detect-*,libhashbrown-*,librustc_std_workspace_alloc-*,libminiz_oxide-*,libadler2-*,libunwind-*,liblibc-*,librustc_std_workspace_core-*,liballoc-*,libcore-*,libcompiler_builtins-*}.rlib" "-Wl,-Bdynamic" "-lgcc_s" "-lutil" "-lrt" "-lpthread" "-lm" "-ldl" "-lc" "-L" "/opt/rustwide/target/debug/build/pctx_code_execution_runtime/03e6ffd24ada46ce/out/rustcatE8PZ/raw-dylibs" "-B<sysroot>/lib/rustlib/x86_64-unknown-linux-gnu/bin/gcc-ld" "-fuse-ld=lld" "-Wl,--eh-frame-hdr" "-Wl,-z,noexecstack" "-L" "/opt/rustwide/target/debug/build/zstd-sys/9d733dff57681120/out" "-L" "/opt/rustwide/target/debug/build/aws-lc-sys/0f1ef95018734c44/out" "-L" "<sysroot>/lib/rustlib/x86_64-unknown-linux-gnu/lib" "-o" "/opt/rustwide/target/debug/build/pctx_code_execution_runtime/03e6ffd24ada46ce/out/build_script_build" "-Wl,--gc-sections" "-pie" "-Wl,-z,relro,-z,now" "-nodefaultlibs" [INFO] [stderr] = note: some arguments are omitted. use `--verbose` to show all linker arguments [INFO] [stderr] = note: rust-lld: error: undefined symbol: v8__FunctionCallbackInfo__GetParts [INFO] [stderr] >>> referenced by function.rs:307 (/opt/rustwide/cargo-home/registry/src/index.crates.io-1949cf8c6b5b557f/v8-150.4.0/src/function.rs:307) [INFO] [stderr] >>> /opt/rustwide/target/debug/build/pctx_code_execution_runtime/03e6ffd24ada46ce/out/build_script_build.284vt5micnkxe3rrqeapzt60e.1oiosva.rcgu.o:(<build_script_build::op_sleep::op_sleep>::slow_function_impl) [INFO] [stderr] >>> referenced by function.rs:307 (/opt/rustwide/cargo-home/registry/src/index.crates.io-1949cf8c6b5b557f/v8-150.4.0/src/function.rs:307) [INFO] [stderr] >>> /opt/rustwide/target/debug/build/pctx_code_execution_runtime/03e6ffd24ada46ce/out/build_script_build.284vt5micnkxe3rrqeapzt60e.1oiosva.rcgu.o:(<build_script_build::op_invoke::op_invoke>::slow_function_impl) [INFO] [stderr] >>> referenced by function.rs:307 (/opt/rustwide/cargo-home/registry/src/index.crates.io-1949cf8c6b5b557f/v8-150.4.0/src/function.rs:307) [INFO] [stderr] >>> deno_core-073a12c7f3aa0b18.deno_core.c4fc8409d83d263f-cgu.14.rcgu.o:(<deno_core::ops_builtin::op_read_all::op_read_all>::slow_function_impl) in archive /opt/rustwide/target/debug/build/deno_core/073a12c7f3aa0b18/out/libdeno_core-073a12c7f3aa0b18.rlib [INFO] [stderr] >>> referenced 99 more times [INFO] [stderr] [INFO] [stderr] rust-lld: error: undefined symbol: v8__External__Value [INFO] [stderr] >>> referenced by external.rs:33 (/opt/rustwide/cargo-home/registry/src/index.crates.io-1949cf8c6b5b557f/v8-150.4.0/src/external.rs:33) [INFO] [stderr] >>> /opt/rustwide/target/debug/build/pctx_code_execution_runtime/03e6ffd24ada46ce/out/build_script_build.284vt5micnkxe3rrqeapzt60e.1oiosva.rcgu.o:(<build_script_build::op_sleep::op_sleep>::slow_function_impl) [INFO] [stderr] >>> referenced by external.rs:33 (/opt/rustwide/cargo-home/registry/src/index.crates.io-1949cf8c6b5b557f/v8-150.4.0/src/external.rs:33) [INFO] [stderr] >>> /opt/rustwide/target/debug/build/pctx_code_execution_runtime/03e6ffd24ada46ce/out/build_script_build.284vt5micnkxe3rrqeapzt60e.1oiosva.rcgu.o:(<build_script_build::op_invoke::op_invoke>::slow_function_impl) [INFO] [stderr] >>> referenced by external.rs:33 (/opt/rustwide/cargo-home/registry/src/index.crates.io-1949cf8c6b5b557f/v8-150.4.0/src/external.rs:33) [INFO] [stderr] >>> deno_core-073a12c7f3aa0b18.deno_core.c4fc8409d83d263f-cgu.14.rcgu.o:(<deno_core::ops_builtin::op_read_all::op_read_all>::slow_function_impl) in archive /opt/rustwide/target/debug/build/deno_core/073a12c7f3aa0b18/out/libdeno_core-073a12c7f3aa0b18.rlib [INFO] [stderr] >>> referenced 120 more times [INFO] [stderr] [INFO] [stderr] rust-lld: error: undefined symbol: v8__FunctionCallbackInfo__Get [INFO] [stderr] >>> referenced by function.rs:358 (/opt/rustwide/cargo-home/registry/src/index.crates.io-1949cf8c6b5b557f/v8-150.4.0/src/function.rs:358) [INFO] [stderr] >>> /opt/rustwide/target/debug/build/pctx_code_execution_runtime/03e6ffd24ada46ce/out/build_script_build.284vt5micnkxe3rrqeapzt60e.1oiosva.rcgu.o:(<build_script_build::op_sleep::op_sleep>::slow_function_impl) [INFO] [stderr] >>> referenced by function.rs:358 (/opt/rustwide/cargo-home/registry/src/index.crates.io-1949cf8c6b5b557f/v8-150.4.0/src/function.rs:358) [INFO] [stderr] >>> /opt/rustwide/target/debug/build/pctx_code_execution_runtime/03e6ffd24ada46ce/out/build_script_build.284vt5micnkxe3rrqeapzt60e.1oiosva.rcgu.o:(<build_script_build::op_sleep::op_sleep>::slow_function_impl) [INFO] [stderr] >>> referenced by function.rs:358 (/opt/rustwide/cargo-home/registry/src/index.crates.io-1949cf8c6b5b557f/v8-150.4.0/src/function.rs:358) [INFO] [stderr] >>> /opt/rustwide/target/debug/build/pctx_code_execution_runtime/03e6ffd24ada46ce/out/build_script_build.284vt5micnkxe3rrqeapzt60e.1oiosva.rcgu.o:(<build_script_build::op_invoke::op_invoke>::slow_function_impl) [INFO] [stderr] >>> referenced 150 more times [INFO] [stderr] [INFO] [stderr] rust-lld: error: undefined symbol: v8__ReturnValue__Value__SetNull [INFO] [stderr] >>> referenced by function.rs:252 (/opt/rustwide/cargo-home/registry/src/index.crates.io-1949cf8c6b5b557f/v8-150.4.0/src/function.rs:252) [INFO] [stderr] >>> /opt/rustwide/target/debug/build/pctx_code_execution_runtime/03e6ffd24ada46ce/out/build_script_build.284vt5micnkxe3rrqeapzt60e.1oiosva.rcgu.o:(<build_script_build::op_sleep::op_sleep>::slow_function_impl) [INFO] [stderr] >>> referenced by function.rs:252 (/opt/rustwide/cargo-home/registry/src/index.crates.io-1949cf8c6b5b557f/v8-150.4.0/src/function.rs:252) [INFO] [stderr] >>> deno_core-073a12c7f3aa0b18.deno_core.c4fc8409d83d263f-cgu.08.rcgu.o:(<core::option::Option<v8::handle::Local<v8::data::Value>> as deno_core::runtime::ops_rust_to_v8::RustToV8RetVal>::to_v8_rv) in archive /opt/rustwide/target/debug/build/deno_core/073a12c7f3aa0b18/out/libdeno_core-073a12c7f3aa0b18.rlib [INFO] [stderr] >>> referenced by function.rs:252 (/opt/rustwide/cargo-home/registry/src/index.crates.io-1949cf8c6b5b557f/v8-150.4.0/src/function.rs:252) [INFO] [stderr] >>> deno_core-073a12c7f3aa0b18.deno_core.c4fc8409d83d263f-cgu.14.rcgu.o:(<deno_core::ops_builtin::op_shutdown::op_shutdown>::slow_function_impl) in archive /opt/rustwide/target/debug/build/deno_core/073a12c7f3aa0b18/out/libdeno_core-073a12c7f3aa0b18.rlib [INFO] [stderr] >>> referenced 29 more times [INFO] [stderr] [INFO] [stderr] rust-lld: error: undefined symbol: v8__Value__IsString [INFO] [stderr] >>> referenced by value.rs:203 (/opt/rustwide/cargo-home/registry/src/index.crates.io-1949cf8c6b5b557f/v8-150.4.0/src/value.rs:203) [INFO] [stderr] >>> /opt/rustwide/target/debug/build/pctx_code_execution_runtime/03e6ffd24ada46ce/out/build_script_build.284vt5micnkxe3rrqeapzt60e.1oiosva.rcgu.o:(<build_script_build::op_invoke::op_invoke>::slow_function_impl) [INFO] [stderr] >>> referenced by value.rs:203 (/opt/rustwide/cargo-home/registry/src/index.crates.io-1949cf8c6b5b557f/v8-150.4.0/src/value.rs:203) [INFO] [stderr] >>> /opt/rustwide/target/debug/build/pctx_code_execution_runtime/03e6ffd24ada46ce/out/build_script_build.284vt5micnkxe3rrqeapzt60e.1oiosva.rcgu.o:(<build_script_build::op_invoke::op_invoke>::slow_function_impl) [INFO] [stderr] >>> referenced by value.rs:203 (/opt/rustwide/cargo-home/registry/src/index.crates.io-1949cf8c6b5b557f/v8-150.4.0/src/value.rs:203) [INFO] [stderr] >>> /opt/rustwide/target/debug/build/pctx_code_execution_runtime/03e6ffd24ada46ce/out/build_script_build.6ajsaefcdpukngevvj3lhba51.1oiosva.rcgu.o:(<&mut serde_v8::de::Deserializer as serde_core::de::Deserializer>::deserialize_string::<serde_json::raw::BoxedFromString>) [INFO] [stderr] >>> referenced 27 more times [INFO] [stderr] [INFO] [stderr] rust-lld: error: undefined symbol: v8__Map__As__Array [INFO] [stderr] >>> referenced by object.rs:1227 (/opt/rustwide/cargo-home/registry/src/index.crates.io-1949cf8c6b5b557f/v8-150.4.0/src/object.rs:1227) [INFO] [stderr] >>> /opt/rustwide/target/debug/build/pctx_code_execution_runtime/03e6ffd24ada46ce/out/build_script_build.66lhc9n5r3a8ght1dq5ley3x5.1oiosva.rcgu.o:(<v8::data::Map>::as_array::{closure#0}) [INFO] [stderr] [INFO] [stderr] rust-lld: error: undefined symbol: v8__ReturnValue__Value__Set [INFO] [stderr] >>> referenced by function.rs:227 (/opt/rustwide/cargo-home/registry/src/index.crates.io-1949cf8c6b5b557f/v8-150.4.0/src/function.rs:227) [INFO] [stderr] >>> /opt/rustwide/target/debug/build/pctx_code_execution_runtime/03e6ffd24ada46ce/out/build_script_build.284vt5micnkxe3rrqeapzt60e.1oiosva.rcgu.o:(<build_script_build::op_invoke::op_invoke>::slow_function_impl) [INFO] [stderr] >>> referenced by function.rs:227 (/opt/rustwide/cargo-home/registry/src/index.crates.io-1949cf8c6b5b557f/v8-150.4.0/src/function.rs:227) [INFO] [stderr] >>> deno_core-073a12c7f3aa0b18.deno_core.c4fc8409d83d263f-cgu.08.rcgu.o:(deno_core::error::callsite_fns::is_toplevel) in archive /opt/rustwide/target/debug/build/deno_core/073a12c7f3aa0b18/out/libdeno_core-073a12c7f3aa0b18.rlib [INFO] [stderr] >>> referenced by function.rs:227 (/opt/rustwide/cargo-home/registry/src/index.crates.io-1949cf8c6b5b557f/v8-150.4.0/src/function.rs:227) [INFO] [stderr] >>> deno_core-073a12c7f3aa0b18.deno_core.c4fc8409d83d263f-cgu.08.rcgu.o:(deno_core::error::callsite_fns::get_function) in archive /opt/rustwide/target/debug/build/deno_core/073a12c7f3aa0b18/out/libdeno_core-073a12c7f3aa0b18.rlib [INFO] [stderr] >>> referenced 45 more times [INFO] [stderr] [INFO] [stderr] rust-lld: error: undefined symbol: v8__Value__IsUndefined [INFO] [stderr] >>> referenced by value.rs:157 (/opt/rustwide/cargo-home/registry/src/index.crates.io-1949cf8c6b5b557f/v8-150.4.0/src/value.rs:157) [INFO] [stderr] >>> /opt/rustwide/target/debug/build/pctx_code_execution_runtime/03e6ffd24ada46ce/out/build_script_build.6ajsaefcdpukngevvj3lhba51.1oiosva.rcgu.o:(<serde_v8::de::MapObjectAccess as serde_core::de::MapAccess>::next_key_seed::<core::marker::PhantomData<alloc::string::String>>) [INFO] [stderr] >>> referenced by value.rs:157 (/opt/rustwide/cargo-home/registry/src/index.crates.io-1949cf8c6b5b557f/v8-150.4.0/src/value.rs:157) [INFO] [stderr] >>> /opt/rustwide/target/debug/build/pctx_code_execution_runtime/03e6ffd24ada46ce/out/build_script_build.6ajsaefcdpukngevvj3lhba51.1oiosva.rcgu.o:(<serde_v8::de::MapObjectAccess as serde_core::de::MapAccess>::next_key_seed::<serde_json::value::de::KeyClassifier>) [INFO] [stderr] >>> referenced by value.rs:157 (/opt/rustwide/cargo-home/registry/src/index.crates.io-1949cf8c6b5b557f/v8-150.4.0/src/value.rs:157) [INFO] [stderr] >>> deno_core-073a12c7f3aa0b18.deno_core.c4fc8409d83d263f-cgu.02.rcgu.o:(<deno_core::error::JsError>::inner_from_v8_exception::{closure#2}) in archive /opt/rustwide/target/debug/build/deno_core/073a12c7f3aa0b18/out/libdeno_core-073a12c7f3aa0b18.rlib [INFO] [stderr] >>> referenced 12 more times [INFO] [stderr] [INFO] [stderr] rust-lld: error: undefined symbol: v8__Null [INFO] [stderr] >>> referenced by primitives.rs:20 (/opt/rustwide/cargo-home/registry/src/index.crates.io-1949cf8c6b5b557f/v8-150.4.0/src/primitives.rs:20) [INFO] [stderr] >>> /opt/rustwide/target/debug/build/pctx_code_execution_runtime/03e6ffd24ada46ce/out/build_script_build.asmtxok8oq0vty6uczs2yh4t0.1oiosva.rcgu.o:(<build_script_build::op_sleep::op_sleep>::slow_function_impl::{closure#0}) [INFO] [stderr] >>> referenced by primitives.rs:20 (/opt/rustwide/cargo-home/registry/src/index.crates.io-1949cf8c6b5b557f/v8-150.4.0/src/primitives.rs:20) [INFO] [stderr] >>> deno_core-073a12c7f3aa0b18.deno_core.c4fc8409d83d263f-cgu.11.rcgu.o:(<deno_core::ops_builtin_v8::op_eval_context::op_eval_context>::call) in archive /opt/rustwide/target/debug/build/deno_core/073a12c7f3aa0b18/out/libdeno_core-073a12c7f3aa0b18.rlib [INFO] [stderr] >>> referenced by primitives.rs:20 (/opt/rustwide/cargo-home/registry/src/index.crates.io-1949cf8c6b5b557f/v8-150.4.0/src/primitives.rs:20) [INFO] [stderr] >>> deno_core-073a12c7f3aa0b18.deno_core.c4fc8409d83d263f-cgu.11.rcgu.o:(<deno_core::ops_builtin_v8::op_compile_function::op_compile_function>::call) in archive /opt/rustwide/target/debug/build/deno_core/073a12c7f3aa0b18/out/libdeno_core-073a12c7f3aa0b18.rlib [INFO] [stderr] >>> referenced 28 more times [INFO] [stderr] [INFO] [stderr] rust-lld: error: undefined symbol: v8__Value__IsObject [INFO] [stderr] >>> referenced by value.rs:229 (/opt/rustwide/cargo-home/registry/src/index.crates.io-1949cf8c6b5b557f/v8-150.4.0/src/value.rs:229) [INFO] [stderr] >>> /opt/rustwide/target/debug/build/pctx_code_execution_runtime/03e6ffd24ada46ce/out/build_script_build.6hteu64qmtq2h15l82d13kk78.1oiosva.rcgu.o:(<v8::handle::Local<v8::data::Object> as core::convert::TryFrom<v8::handle::Local<v8::data::Value>>>::try_from) [INFO] [stderr] >>> referenced by value.rs:229 (/opt/rustwide/cargo-home/registry/src/index.crates.io-1949cf8c6b5b557f/v8-150.4.0/src/value.rs:229) [INFO] [stderr] >>> deno_core-073a12c7f3aa0b18.deno_core.c4fc8409d83d263f-cgu.04.rcgu.o:(<v8::handle::Local<v8::data::Object> as core::convert::TryFrom<v8::handle::Local<v8::data::Data>>>::try_from) in archive /opt/rustwide/target/debug/build/deno_core/073a12c7f3aa0b18/out/libdeno_core-073a12c7f3aa0b18.rlib [INFO] [stderr] >>> referenced by value.rs:229 (/opt/rustwide/cargo-home/registry/src/index.crates.io-1949cf8c6b5b557f/v8-150.4.0/src/value.rs:229) [INFO] [stderr] >>> deno_core-073a12c7f3aa0b18.deno_core.c4fc8409d83d263f-cgu.04.rcgu.o:(<v8::handle::Local<v8::data::Object> as core::convert::TryFrom<v8::handle::Local<v8::data::Value>>>::try_from) in archive /opt/rustwide/target/debug/build/deno_core/073a12c7f3aa0b18/out/libdeno_core-073a12c7f3aa0b18.rlib [INFO] [stderr] >>> referenced 6 more times [INFO] [stderr] [INFO] [stderr] rust-lld: error: undefined symbol: v8__Value__IsUint32 [INFO] [stderr] >>> referenced by value.rs:267 (/opt/rustwide/cargo-home/registry/src/index.crates.io-1949cf8c6b5b557f/v8-150.4.0/src/value.rs:267) [INFO] [stderr] >>> /opt/rustwide/target/debug/build/pctx_code_execution_runtime/03e6ffd24ada46ce/out/build_script_build.6ajsaefcdpukngevvj3lhba51.1oiosva.rcgu.o:(<&mut serde_v8::de::Deserializer as serde_core::de::Deserializer>::deserialize_any::<<serde_json::value::Value as serde_core::de::Deserialize>::deserialize::ValueVisitor>) [INFO] [stderr] >>> referenced by value.rs:267 (/opt/rustwide/cargo-home/registry/src/index.crates.io-1949cf8c6b5b557f/v8-150.4.0/src/value.rs:267) [INFO] [stderr] >>> deno_core-073a12c7f3aa0b18.deno_core.c4fc8409d83d263f-cgu.12.rcgu.o:(deno_core::runtime::ops::to_i32_option) in archive /opt/rustwide/target/debug/build/deno_core/073a12c7f3aa0b18/out/libdeno_core-073a12c7f3aa0b18.rlib [INFO] [stderr] >>> referenced by value.rs:267 (/opt/rustwide/cargo-home/registry/src/index.crates.io-1949cf8c6b5b557f/v8-150.4.0/src/value.rs:267) [INFO] [stderr] >>> deno_core-073a12c7f3aa0b18.deno_core.c4fc8409d83d263f-cgu.12.rcgu.o:(deno_core::runtime::ops::to_i64_option) in archive /opt/rustwide/target/debug/build/deno_core/073a12c7f3aa0b18/out/libdeno_core-073a12c7f3aa0b18.rlib [INFO] [stderr] >>> referenced 3 more times [INFO] [stderr] [INFO] [stderr] rust-lld: error: undefined symbol: v8__Value__IsInt32 [INFO] [stderr] >>> referenced by value.rs:261 (/opt/rustwide/cargo-home/registry/src/index.crates.io-1949cf8c6b5b557f/v8-150.4.0/src/value.rs:261) [INFO] [stderr] >>> /opt/rustwide/target/debug/build/pctx_code_execution_runtime/03e6ffd24ada46ce/out/build_script_build.6ajsaefcdpukngevvj3lhba51.1oiosva.rcgu.o:(<&mut serde_v8::de::Deserializer as serde_core::de::Deserializer>::deserialize_any::<<serde_json::value::Value as serde_core::de::Deserialize>::deserialize::ValueVisitor>) [INFO] [stderr] >>> referenced by value.rs:261 (/opt/rustwide/cargo-home/registry/src/index.crates.io-1949cf8c6b5b557f/v8-150.4.0/src/value.rs:261) [INFO] [stderr] >>> deno_core-073a12c7f3aa0b18.deno_core.c4fc8409d83d263f-cgu.12.rcgu.o:(deno_core::runtime::ops::to_i32_option) in archive /opt/rustwide/target/debug/build/deno_core/073a12c7f3aa0b18/out/libdeno_core-073a12c7f3aa0b18.rlib [INFO] [stderr] >>> referenced by value.rs:261 (/opt/rustwide/cargo-home/registry/src/index.crates.io-1949cf8c6b5b557f/v8-150.4.0/src/value.rs:261) [INFO] [stderr] >>> deno_core-073a12c7f3aa0b18.deno_core.c4fc8409d83d263f-cgu.12.rcgu.o:(deno_core::runtime::ops::to_i64_option) in archive /opt/rustwide/target/debug/build/deno_core/073a12c7f3aa0b18/out/libdeno_core-073a12c7f3aa0b18.rlib [INFO] [stderr] >>> referenced 2 more times [INFO] [stderr] [INFO] [stderr] rust-lld: error: undefined symbol: v8__Number__Value [INFO] [stderr] >>> referenced by number.rs:39 (/opt/rustwide/cargo-home/registry/src/index.crates.io-1949cf8c6b5b557f/v8-150.4.0/src/number.rs:39) [INFO] [stderr] >>> /opt/rustwide/target/debug/build/pctx_code_execution_runtime/03e6ffd24ada46ce/out/build_script_build.6ajsaefcdpukngevvj3lhba51.1oiosva.rcgu.o:(<&mut serde_v8::de::Deserializer as serde_core::de::Deserializer>::deserialize_f64::<<serde_json::value::Value as serde_core::de::Deserialize>::deserialize::ValueVisitor>) [INFO] [stderr] >>> referenced by number.rs:39 (/opt/rustwide/cargo-home/registry/src/index.crates.io-1949cf8c6b5b557f/v8-150.4.0/src/number.rs:39) [INFO] [stderr] >>> /opt/rustwide/target/debug/build/pctx_code_execution_runtime/03e6ffd24ada46ce/out/build_script_build.6ajsaefcdpukngevvj3lhba51.1oiosva.rcgu.o:(<&mut serde_v8::de::Deserializer as serde_core::de::Deserializer>::deserialize_i32::<<serde_json::value::Value as serde_core::de::Deserialize>::deserialize::ValueVisitor>) [INFO] [stderr] >>> referenced by number.rs:39 (/opt/rustwide/cargo-home/registry/src/index.crates.io-1949cf8c6b5b557f/v8-150.4.0/src/number.rs:39) [INFO] [stderr] >>> /opt/rustwide/target/debug/build/pctx_code_execution_runtime/03e6ffd24ada46ce/out/build_script_build.6ajsaefcdpukngevvj3lhba51.1oiosva.rcgu.o:(<&mut serde_v8::de::Deserializer as serde_core::de::Deserializer>::deserialize_u32::<<serde_json::value::Value as serde_core::de::Deserialize>::deserialize::ValueVisitor>) [INFO] [stderr] >>> referenced 11 more times [INFO] [stderr] [INFO] [stderr] rust-lld: error: undefined symbol: v8__BigInt__Int64Value [INFO] [stderr] >>> referenced by bigint.rs:99 (/opt/rustwide/cargo-home/registry/src/index.crates.io-1949cf8c6b5b557f/v8-150.4.0/src/bigint.rs:99) [INFO] [stderr] >>> /opt/rustwide/target/debug/build/pctx_code_execution_runtime/03e6ffd24ada46ce/out/build_script_build.6ajsaefcdpukngevvj3lhba51.1oiosva.rcgu.o:(<&mut serde_v8::de::Deserializer as serde_core::de::Deserializer>::deserialize_i32::<<serde_json::value::Value as serde_core::de::Deserialize>::deserialize::ValueVisitor>) [INFO] [stderr] >>> referenced by bigint.rs:99 (/opt/rustwide/cargo-home/registry/src/index.crates.io-1949cf8c6b5b557f/v8-150.4.0/src/bigint.rs:99) [INFO] [stderr] >>> deno_core-073a12c7f3aa0b18.deno_core.c4fc8409d83d263f-cgu.13.rcgu.o:(<&mut serde_v8::de::Deserializer as serde_core::de::Deserializer>::deserialize_i64::<<i64 as serde_core::de::Deserialize>::deserialize::PrimitiveVisitor>) in archive /opt/rustwide/target/debug/build/deno_core/073a12c7f3aa0b18/out/libdeno_core-073a12c7f3aa0b18.rlib [INFO] [stderr] >>> referenced by bigint.rs:99 (/opt/rustwide/cargo-home/registry/src/index.crates.io-1949cf8c6b5b557f/v8-150.4.0/src/bigint.rs:99) [INFO] [stderr] >>> deno_core-073a12c7f3aa0b18.deno_core.c4fc8409d83d263f-cgu.12.rcgu.o:(deno_core::runtime::ops::to_f64_option) in archive /opt/rustwide/target/debug/build/deno_core/073a12c7f3aa0b18/out/libdeno_core-073a12c7f3aa0b18.rlib [INFO] [stderr] >>> referenced 1 more times [INFO] [stderr] [INFO] [stderr] rust-lld: error: undefined symbol: v8__Array__Length [INFO] [stderr] >>> referenced by object.rs:1158 (/opt/rustwide/cargo-home/registry/src/index.crates.io-1949cf8c6b5b557f/v8-150.4.0/src/object.rs:1158) [INFO] [stderr] >>> /opt/rustwide/target/debug/build/pctx_code_execution_runtime/03e6ffd24ada46ce/out/build_script_build.6ajsaefcdpukngevvj3lhba51.1oiosva.rcgu.o:(<&mut serde_v8::de::Deserializer as serde_core::de::Deserializer>::deserialize_map::<<serde_json::value::Value as serde_core::de::Deserialize>::deserialize::ValueVisitor>) [INFO] [stderr] >>> referenced by object.rs:1158 (/opt/rustwide/cargo-home/registry/src/index.crates.io-1949cf8c6b5b557f/v8-150.4.0/src/object.rs:1158) [INFO] [stderr] >>> /opt/rustwide/target/debug/build/pctx_code_execution_runtime/03e6ffd24ada46ce/out/build_script_build.6ajsaefcdpukngevvj3lhba51.1oiosva.rcgu.o:(<&mut serde_v8::de::Deserializer as serde_core::de::Deserializer>::deserialize_map::<<serde_json::map::Map<alloc::string::String, serde_json::value::Value> as serde_core::de::Deserialize>::deserialize::Visitor>) [INFO] [stderr] >>> referenced by object.rs:1158 (/opt/rustwide/cargo-home/registry/src/index.crates.io-1949cf8c6b5b557f/v8-150.4.0/src/object.rs:1158) [INFO] [stderr] >>> /opt/rustwide/target/debug/build/pctx_code_execution_runtime/03e6ffd24ada46ce/out/build_script_build.6ajsaefcdpukngevvj3lhba51.1oiosva.rcgu.o:(<&mut serde_v8::de::Deserializer as serde_core::de::Deserializer>::deserialize_seq::<<serde_json::value::Value as serde_core::de::Deserialize>::deserialize::ValueVisitor>) [INFO] [stderr] >>> referenced 22 more times [INFO] [stderr] [INFO] [stderr] rust-lld: error: undefined symbol: v8__BigInt__Uint64Value [INFO] [stderr] >>> referenced by bigint.rs:88 (/opt/rustwide/cargo-home/registry/src/index.crates.io-1949cf8c6b5b557f/v8-150.4.0/src/bigint.rs:88) [INFO] [stderr] >>> /opt/rustwide/target/debug/build/pctx_code_execution_runtime/03e6ffd24ada46ce/out/build_script_build.6ajsaefcdpukngevvj3lhba51.1oiosva.rcgu.o:(<&mut serde_v8::de::Deserializer as serde_core::de::Deserializer>::deserialize_u32::<<serde_json::value::Value as serde_core::de::Deserialize>::deserialize::ValueVisitor>) [INFO] [stderr] >>> referenced by bigint.rs:88 (/opt/rustwide/cargo-home/registry/src/index.crates.io-1949cf8c6b5b557f/v8-150.4.0/src/bigint.rs:88) [INFO] [stderr] >>> deno_core-073a12c7f3aa0b18.deno_core.c4fc8409d83d263f-cgu.12.rcgu.o:(deno_core::runtime::ops::to_i64_option) in archive /opt/rustwide/target/debug/build/deno_core/073a12c7f3aa0b18/out/libdeno_core-073a12c7f3aa0b18.rlib [INFO] [stderr] >>> referenced by bigint.rs:88 (/opt/rustwide/cargo-home/registry/src/index.crates.io-1949cf8c6b5b557f/v8-150.4.0/src/bigint.rs:88) [INFO] [stderr] >>> deno_core-073a12c7f3aa0b18.deno_core.c4fc8409d83d263f-cgu.12.rcgu.o:(deno_core::runtime::ops::to_u32_option) in archive /opt/rustwide/target/debug/build/deno_core/073a12c7f3aa0b18/out/libdeno_core-073a12c7f3aa0b18.rlib [INFO] [stderr] >>> referenced 1 more times [INFO] [stderr] [INFO] [stderr] rust-lld: error: undefined symbol: v8__Value__IsTrue [INFO] [stderr] >>> referenced by value.rs:179 (/opt/rustwide/cargo-home/registry/src/index.crates.io-1949cf8c6b5b557f/v8-150.4.0/src/value.rs:179) [INFO] [stderr] >>> /opt/rustwide/target/debug/build/pctx_code_execution_runtime/03e6ffd24ada46ce/out/build_script_build.6ajsaefcdpukngevvj3lhba51.1oiosva.rcgu.o:(<&mut serde_v8::de::Deserializer as serde_core::de::Deserializer>::deserialize_bool::<<serde_json::value::Value as serde_core::de::Deserialize>::deserialize::ValueVisitor>) [INFO] [stderr] >>> referenced by value.rs:179 (/opt/rustwide/cargo-home/registry/src/index.crates.io-1949cf8c6b5b557f/v8-150.4.0/src/value.rs:179) [INFO] [stderr] >>> serde_v8-0e8cd4ab7fdffebc.serde_v8.33ba2df7a2c5ea09-cgu.0.rcgu.o:(<&mut serde_v8::de::Deserializer as serde_core::de::Deserializer>::deserialize_bool::<serde_core::de::impls::BoolVisitor>) in archive /opt/rustwide/target/debug/build/serde_v8/0e8cd4ab7fdffebc/out/libserde_v8-0e8cd4ab7fdffebc.rlib [INFO] [stderr] >>> referenced by value.rs:179 (/opt/rustwide/cargo-home/registry/src/index.crates.io-1949cf8c6b5b557f/v8-150.4.0/src/value.rs:179) [INFO] [stderr] >>> deno_core-073a12c7f3aa0b18.deno_core.c4fc8409d83d263f-cgu.11.rcgu.o:(<deno_core::ops_builtin_v8::op_serialize::op_serialize>::slow_function_impl) in archive /opt/rustwide/target/debug/build/deno_core/073a12c7f3aa0b18/out/libdeno_core-073a12c7f3aa0b18.rlib [INFO] [stderr] >>> referenced 7 more times [INFO] [stderr] [INFO] [stderr] rust-lld: error: undefined symbol: v8__Value__IsNullOrUndefined [INFO] [stderr] >>> referenced by value.rs:170 (/opt/rustwide/cargo-home/registry/src/index.crates.io-1949cf8c6b5b557f/v8-150.4.0/src/value.rs:170) [INFO] [stderr] >>> /opt/rustwide/target/debug/build/pctx_code_execution_runtime/03e6ffd24ada46ce/out/build_script_build.6ajsaefcdpukngevvj3lhba51.1oiosva.rcgu.o:(<&mut serde_v8::de::Deserializer as serde_core::de::Deserializer>::deserialize_option::<serde_core::de::impls::OptionVisitor<serde_json::map::Map<alloc::string::String, serde_json::value::Value>>>) [INFO] [stderr] >>> referenced by value.rs:170 (/opt/rustwide/cargo-home/registry/src/index.crates.io-1949cf8c6b5b557f/v8-150.4.0/src/value.rs:170) [INFO] [stderr] >>> deno_core-073a12c7f3aa0b18.deno_core.c4fc8409d83d263f-cgu.13.rcgu.o:(<&mut serde_v8::de::Deserializer as serde_core::de::Deserializer>::deserialize_option::<serde_core::de::impls::OptionVisitor<alloc::string::String>>) in archive /opt/rustwide/target/debug/build/deno_core/073a12c7f3aa0b18/out/libdeno_core-073a12c7f3aa0b18.rlib [INFO] [stderr] >>> referenced by value.rs:170 (/opt/rustwide/cargo-home/registry/src/index.crates.io-1949cf8c6b5b557f/v8-150.4.0/src/value.rs:170) [INFO] [stderr] >>> deno_core-073a12c7f3aa0b18.deno_core.c4fc8409d83d263f-cgu.13.rcgu.o:(<&mut serde_v8::de::Deserializer as serde_core::de::Deserializer>::deserialize_option::<serde_core::de::impls::OptionVisitor<bool>>) in archive /opt/rustwide/target/debug/build/deno_core/073a12c7f3aa0b18/out/libdeno_core-073a12c7f3aa0b18.rlib [INFO] [stderr] >>> referenced 16 more times [INFO] [stderr] [INFO] [stderr] rust-lld: error: undefined symbol: v8__Value__IsStringObject [INFO] [stderr] >>> referenced by value.rs:303 (/opt/rustwide/cargo-home/registry/src/index.crates.io-1949cf8c6b5b557f/v8-150.4.0/src/value.rs:303) [INFO] [stderr] >>> /opt/rustwide/target/debug/build/pctx_code_execution_runtime/03e6ffd24ada46ce/out/build_script_build.6ajsaefcdpukngevvj3lhba51.1oiosva.rcgu.o:(<&mut serde_v8::de::Deserializer as serde_core::de::Deserializer>::deserialize_string::<serde_json::raw::BoxedFromString>) [INFO] [stderr] >>> referenced by value.rs:303 (/opt/rustwide/cargo-home/registry/src/index.crates.io-1949cf8c6b5b557f/v8-150.4.0/src/value.rs:303) [INFO] [stderr] >>> /opt/rustwide/target/debug/build/pctx_code_execution_runtime/03e6ffd24ada46ce/out/build_script_build.6ajsaefcdpukngevvj3lhba51.1oiosva.rcgu.o:(<&mut serde_v8::de::Deserializer as serde_core::de::Deserializer>::deserialize_string::<serde_json::value::de::KeyClassifier>) [INFO] [stderr] >>> referenced by value.rs:303 (/opt/rustwide/cargo-home/registry/src/index.crates.io-1949cf8c6b5b557f/v8-150.4.0/src/value.rs:303) [INFO] [stderr] >>> /opt/rustwide/target/debug/build/pctx_code_execution_runtime/03e6ffd24ada46ce/out/build_script_build.6ajsaefcdpukngevvj3lhba51.1oiosva.rcgu.o:(<&mut serde_v8::de::Deserializer as serde_core::de::Deserializer>::deserialize_string::<<serde_json::value::Value as serde_core::de::Deserialize>::deserialize::ValueVisitor>) [INFO] [stderr] >>> referenced 4 more times [INFO] [stderr] [INFO] [stderr] rust-lld: error: undefined symbol: v8__Value__IsArray [INFO] [stderr] >>> referenced by value.rs:223 (/opt/rustwide/cargo-home/registry/src/index.crates.io-1949cf8c6b5b557f/v8-150.4.0/src/value.rs:223) [INFO] [stderr] >>> /opt/rustwide/target/debug/build/pctx_code_execution_runtime/03e6ffd24ada46ce/out/build_script_build.6hteu64qmtq2h15l82d13kk78.1oiosva.rcgu.o:(<v8::handle::Local<v8::data::Array> as core::convert::TryFrom<v8::handle::Local<v8::data::Value>>>::try_from) [INFO] [stderr] >>> referenced by value.rs:223 (/opt/rustwide/cargo-home/registry/src/index.crates.io-1949cf8c6b5b557f/v8-150.4.0/src/value.rs:223) [INFO] [stderr] >>> deno_core-073a12c7f3aa0b18.deno_core.c4fc8409d83d263f-cgu.04.rcgu.o:(<v8::handle::Local<v8::data::Array> as core::convert::TryFrom<v8::handle::Local<v8::data::Value>>>::try_from) in archive /opt/rustwide/target/debug/build/deno_core/073a12c7f3aa0b18/out/libdeno_core-073a12c7f3aa0b18.rlib [INFO] [stderr] >>> referenced by value.rs:223 (/opt/rustwide/cargo-home/registry/src/index.crates.io-1949cf8c6b5b557f/v8-150.4.0/src/value.rs:223) [INFO] [stderr] >>> serde_v8-0e8cd4ab7fdffebc.serde_v8.33ba2df7a2c5ea09-cgu.0.rcgu.o:(<serde_v8::payload::ValueType>::from_v8) in archive /opt/rustwide/target/debug/build/serde_v8/0e8cd4ab7fdffebc/out/libserde_v8-0e8cd4ab7fdffebc.rlib [INFO] [stderr] >>> referenced 1 more times [INFO] [stderr] [INFO] [stderr] rust-lld: error: too many errors emitted, stopping now (use --error-limit=0 to see all errors) [INFO] [stderr] collect2: error: ld returned 1 exit status [INFO] [stderr] [INFO] [stderr] [INFO] [stderr] error: could not compile `pctx_code_execution_runtime` (build script) due to 1 previous error [INFO] [stderr] warning: unused dependency `pctx_config` [INFO] [stderr] --> Cargo.toml:8:21 [INFO] [stderr] | [INFO] [stderr] 8 | [build-dependencies.pctx_config] [INFO] [stderr] | ^^^^^^^^^^^^ [INFO] [stderr] | [INFO] [stderr] = note: `cargo::unused_dependencies` is set to `warn` by default [INFO] [stderr] help: consider removing the dependency on `pctx_config` [INFO] [stderr] warning: `pctx_code_execution_runtime` (manifest) generated 1 warning [INFO] running `"docker" "inspect" "d4c469b0a3aed5c23fe08fbac2ed03862b0d508b77e05f12b0c1f8a7405d4a66"`