ore-boost-api 4.0.0

API for interacting with the ORE boost program
Documentation

Build #3013560 2026-03-14 11:25:19

Build failed. If you want to re-trigger a documentation build, you can do it here. You can find more information on docs.rs builds documentation on the builds page.

# error kind ExecutionFailed

# pre-build errors command failed: exit status: 101

# rustc version rustc 1.96.0-nightly (1d8897a4e 2026-03-13)

# docs.rs version docsrs 0.0.0 (a68728e7 2026-03-08 )

# build log [INFO] running `Command { std: "docker" "create" "-v" "/home/cratesfyi/workspace-builder3/builds/ore-boost-api-4.0.0/target:/opt/rustwide/target:rw,Z" "-v" "/home/cratesfyi/workspace-builder3/builds/ore-boost-api-4.0.0/source:/opt/rustwide/workdir:ro,Z" "-v" "/home/cratesfyi/workspace-builder3/cargo-home:/opt/rustwide/cargo-home:ro,Z" "-v" "/home/cratesfyi/workspace-builder3/rustup-home:/opt/rustwide/rustup-home:ro,Z" "-e" "SOURCE_DIR=/opt/rustwide/workdir" "-e" "CARGO_TARGET_DIR=/opt/rustwide/target" "-e" "DOCS_RS=1" "-e" "CARGO_HOME=/opt/rustwide/cargo-home" "-e" "RUSTUP_HOME=/opt/rustwide/rustup-home" "-w" "/opt/rustwide/workdir" "-m" "6442450944" "--cpus" "6" "--user" "1001:1001" "--network" "none" "ghcr.io/rust-lang/crates-build-env/linux@sha256:d429b63d4308055ea97f60fb1d3dfca48854a00942f1bd2ad806beaf015945ec" "/opt/rustwide/cargo-home/bin/cargo" "+nightly" "rustdoc" "--lib" "-Zrustdoc-map" "--config" "build.rustdocflags=[\"--cfg\", \"docsrs\", \"-Z\", \"unstable-options\", \"--emit=invocation-specific\", \"--resource-suffix\", \"-20260313-1.96.0-nightly-1d8897a4e\", \"--static-root-path\", \"/-/rustdoc.static/\", \"--cap-lints\", \"warn\", \"--extern-html-root-takes-precedence\"]" "--offline" "-Zunstable-options" "--config=doc.extern-map.registries.crates-io=\"https://docs.rs/{pkg_name}/{version}/x86_64-unknown-linux-gnu\"" "-Zrustdoc-scrape-examples" "-j6" "--target" "x86_64-unknown-linux-gnu", kill_on_drop: false }` [INFO] [stderr] WARNING: Your kernel does not support swap limit capabilities or the cgroup is not mounted. Memory limited without swap. [INFO] [stdout] 6b714bf1b7f0368c5fb89da6313edb1c4a644031ad1e2ff2d8e1d379d0673420 [INFO] running `Command { std: "docker" "start" "-a" "6b714bf1b7f0368c5fb89da6313edb1c4a644031ad1e2ff2d8e1d379d0673420", kill_on_drop: false }` [INFO] [stderr] warning: target filter specified, but no targets matched; this is a no-op [INFO] [stderr] Documenting ore-boost-api v4.0.0 (/opt/rustwide/workdir) [INFO] [stderr] error[E0432]: unresolved import `ore_api::state::proof_pda` [INFO] [stderr] --> src/sdk.rs:1:5 [INFO] [stderr] | [INFO] [stderr] 1 | use ore_api::state::proof_pda; [INFO] [stderr] | ^^^^^^^^^^^^^^^^^^^^^^^^^ no `proof_pda` in `state` [INFO] [stderr] [INFO] [stderr] error[E0432]: unresolved import `ore_api::state::Proof` [INFO] [stderr] --> src/state/boost.rs:1:5 [INFO] [stderr] | [INFO] [stderr] 1 | use ore_api::state::Proof; [INFO] [stderr] | ^^^^^^^^^^^^^^^^^^^^^ no `Proof` in `state` [INFO] [stderr] [INFO] [stderr] error[E0432]: unresolved import `ore_api::state::Proof` [INFO] [stderr] --> src/state/stake.rs:1:5 [INFO] [stderr] | [INFO] [stderr] 1 | use ore_api::state::Proof; [INFO] [stderr] | ^^^^^^^^^^^^^^^^^^^^^ no `Proof` in `state` [INFO] [stderr] [INFO] [stderr] For more information about this error, try `rustc --explain E0432`. [INFO] [stderr] error: could not document `ore-boost-api` [INFO] running `Command { std: "docker" "inspect" "6b714bf1b7f0368c5fb89da6313edb1c4a644031ad1e2ff2d8e1d379d0673420", kill_on_drop: false }` [INFO] running `Command { std: "docker" "rm" "-f" "6b714bf1b7f0368c5fb89da6313edb1c4a644031ad1e2ff2d8e1d379d0673420", kill_on_drop: false }` [INFO] [stdout] 6b714bf1b7f0368c5fb89da6313edb1c4a644031ad1e2ff2d8e1d379d0673420