kernal-api 0.1.21

Async OS HAL, profiling, symbolization, and allocator instrumentation

Build #4600607 2026-09-26 01:22:02

Build failed. If you want to re-trigger a documentation build, you can do it here. You can find more information on docs.rs builds documentation on the builds page.

# error kind ExecutionFailed

# pre-build errors command failed: exit status: 101

# rustc version rustc 1.100.0-nightly (f7575a9da 2026-09-24)

# docs.rs version docsrs 0.0.0 (9439cafc1e2ea4a64558a489c81351cd959d6077 2026-09-22 )

# build log [INFO] running `"docker" "exec" "-e" "SOURCE_DIR=/opt/rustwide/workdir" "-e" "CARGO_HOME=/opt/rustwide/cargo-home" "-e" "RUSTUP_HOME=/opt/rustwide/rustup-home" "-e" "CARGO_TARGET_DIR=/opt/rustwide/target" "-e" "DOCS_RS=1" "-w" "/opt/rustwide/workdir" "--user" "1001:1001" "44c38f906ff407c3dc6e35233153f23a595d48086c23f629c546019d8a391337" "/opt/rustwide/cargo-home/bin/cargo" "+nightly" "rustdoc" "--lib" "-Zrustdoc-map" "--features" "full independent-spawn config-toml json source-cpp daemon-identity daemon-frame-v1 daemon-registration daemon-registration-v2 broker-client build-resources" "--config" "build.rustdocflags=[\"--cfg\", \"docsrs\", \"--cfg\", \"docsrs\", \"-Z\", \"unstable-options\", \"--emit=html-non-static-files\", \"--resource-suffix\", \"-20260924-1.100.0-nightly-f7575a9da\", \"--static-root-path\", \"/-/rustdoc.static/\", \"--cap-lints\", \"warn\", \"--extern-html-root-takes-precedence\"]" "--offline" "-Zunstable-options" "--config=doc.extern-map.registries.crates-io=\"https://docs.rs/{pkg_name}/{version}/aarch64-apple-darwin\"" "-j12" "--target" "aarch64-apple-darwin" "-Zrustdoc-scrape-examples"` [INFO] [stderr] warning: `package.homepage` is redundant with `package.repository` [INFO] [stderr] --> Cargo.toml:331:12 [INFO] [stderr] | [INFO] [stderr] 331 | homepage = "https://github.com/zackees/kernal-api" [INFO] [stderr] | ^^^^^^^^^^^^^^^^^^^^^^^^^^^^^^^^^^^^^^^ [INFO] [stderr] ... [INFO] [stderr] 337 | repository = "https://github.com/zackees/kernal-api" [INFO] [stderr] | --------------------------------------- [INFO] [stderr] | [INFO] [stderr] = note: `cargo::redundant_homepage` is set to `warn` by default [INFO] [stderr] help: consider removing `package.homepage` [INFO] [stderr] warning: `kernal-api` (manifest) generated 1 warning [INFO] [stderr] warning: Rustdoc did not scrape the following examples because they require dev-dependencies: wasm-admission [INFO] [stderr] If you want Rustdoc to scrape these examples, then add `doc-scrape-examples = true` [INFO] [stderr] to the [[example]] target configuration of at least one example. [INFO] [stderr] warning: target filter specified, but no targets matched; this is a no-op [INFO] [stderr] Checking zerofrom v0.1.8 [INFO] [stderr] Checking tokio-util v0.7.19 [INFO] [stderr] Compiling logos v0.15.1 [INFO] [stderr] Checking serde v1.0.229 [INFO] [stderr] Compiling logos v0.16.1 [INFO] [stderr] Compiling prost-build v0.14.4 [INFO] [stderr] Compiling ring v0.17.14 [INFO] [stderr] Checking pin-project v1.1.13 [INFO] [stderr] Compiling zstd-sys v2.1.0+zstd.1.5.7 [INFO] [stderr] Checking tokio-stream v0.1.19 [INFO] [stderr] Compiling blake3 v1.8.7 [INFO] [stderr] Checking yoke v0.8.3 [INFO] [stderr] Compiling thiserror-impl v1.0.69 [INFO] [stderr] Compiling zerocopy-derive v0.8.59 [INFO] [stderr] Compiling protox-parse v0.9.0 [INFO] [stderr] Compiling prost-reflect v0.16.5 [INFO] [stderr] warning: blake3@1.8.7: cc: error: unrecognized command-line option '-arch' [INFO] [stderr] warning: blake3@1.8.7: cc: error: unrecognized command-line option '-mmacosx-version-min=11.0' [INFO] [stderr] error: failed to run custom build command for `blake3 v1.8.7` [INFO] [stderr] [INFO] [stderr] Caused by: [INFO] [stderr] process didn't exit successfully: `/opt/rustwide/target/debug/build/blake3/319131496a0643d9/out/build_script_build` (exit status: 1) [INFO] [stderr] --- stdout [INFO] [stderr] cargo::rustc-check-cfg=cfg(blake3_sse2_ffi, values(none())) [INFO] [stderr] cargo::rustc-check-cfg=cfg(blake3_sse2_rust, values(none())) [INFO] [stderr] cargo::rustc-check-cfg=cfg(blake3_sse41_ffi, values(none())) [INFO] [stderr] cargo::rustc-check-cfg=cfg(blake3_sse41_rust, values(none())) [INFO] [stderr] cargo::rustc-check-cfg=cfg(blake3_avx2_ffi, values(none())) [INFO] [stderr] cargo::rustc-check-cfg=cfg(blake3_avx2_rust, values(none())) [INFO] [stderr] cargo::rustc-check-cfg=cfg(blake3_avx512_ffi, values(none())) [INFO] [stderr] cargo::rustc-check-cfg=cfg(blake3_neon, values(none())) [INFO] [stderr] cargo::rustc-check-cfg=cfg(blake3_wasm32_simd, values(none())) [INFO] [stderr] cargo::rerun-if-env-changed=CARGO_FEATURE_PURE [INFO] [stderr] cargo::rerun-if-env-changed=CARGO_FEATURE_NO_NEON [INFO] [stderr] cargo::rerun-if-env-changed=CARGO_FEATURE_NEON [INFO] [stderr] cargo::rerun-if-env-changed=CARGO_FEATURE_NEON [INFO] [stderr] cargo::rerun-if-env-changed=CARGO_FEATURE_NO_NEON [INFO] [stderr] cargo::rerun-if-env-changed=CARGO_FEATURE_PURE [INFO] [stderr] cargo::rustc-cfg=blake3_neon [INFO] [stderr] CC_FORCE_DISABLE = None [INFO] [stderr] CC_aarch64-apple-darwin = None [INFO] [stderr] CC_aarch64_apple_darwin = None [INFO] [stderr] TARGET_CC = None [INFO] [stderr] CC = None [INFO] [stderr] CROSS_COMPILE = None [INFO] [stderr] cargo:rerun-if-env-changed=CC_ENABLE_DEBUG_OUTPUT [INFO] [stderr] CRATE_CC_NO_DEFAULTS = None [INFO] [stderr] CRATE_CC_NO_DEFAULTS = None [INFO] [stderr] MACOSX_DEPLOYMENT_TARGET = None [INFO] [stderr] cargo:rerun-if-env-changed=CC_ENABLE_DEBUG_OUTPUT [INFO] [stderr] CFLAGS = None [INFO] [stderr] TARGET_CFLAGS = None [INFO] [stderr] CFLAGS_aarch64_apple_darwin = None [INFO] [stderr] CFLAGS_aarch64-apple-darwin = None [INFO] [stderr] CFLAGS = None [INFO] [stderr] TARGET_CFLAGS = None [INFO] [stderr] CFLAGS_aarch64_apple_darwin = None [INFO] [stderr] CFLAGS_aarch64-apple-darwin = None [INFO] [stderr] cargo:warning=cc: error: unrecognized command-line option '-arch' [INFO] [stderr] cargo:warning=cc: error: unrecognized command-line option '-mmacosx-version-min=11.0' [INFO] [stderr] [INFO] [stderr] --- stderr [INFO] [stderr] [INFO] [stderr] [INFO] [stderr] error occurred in cc-rs: command did not execute successfully (status code exit status: 1): LC_ALL="C" "cc" "-O0" "-ffunction-sections" "-fdata-sections" "-fPIC" "-g" "-gdwarf-2" "-fno-omit-frame-pointer" "-arch" "arm64" "-mmacosx-version-min=11.0" "-Wall" "-Wextra" "-std=c11" "-o" "/opt/rustwide/target/aarch64-apple-darwin/debug/build/blake3/cf2ae4f33957bea8/out/a1edd97dd51cd48d-blake3_neon.o" "-c" "c/blake3_neon.c" [INFO] [stderr] [INFO] [stderr] [INFO] [stderr] warning: build failed, waiting for other jobs to finish... [INFO] [stderr] warning: ring@0.17.14: cc: error: unrecognized debug output level 'full' [INFO] [stderr] warning: ring@0.17.14: cc: error: unrecognized command-line option '-arch' [INFO] [stderr] warning: ring@0.17.14: cc: error: unrecognized command-line option '-mmacosx-version-min=11.0' [INFO] [stderr] warning: ring@0.17.14: ToolExecError: command did not execute successfully (status code exit status: 1): LC_ALL="C" "cc" "-O0" "-ffunction-sections" "-fdata-sections" "-fPIC" "-g" "-gdwarf-2" "-fno-omit-frame-pointer" "-arch" "arm64" "-mmacosx-version-min=11.0" "-I" "/opt/rustwide/cargo-home/registry/src/index.crates.io-1949cf8c6b5b557f/ring-0.17.14/include" "-I" "/opt/rustwide/cargo-home/registry/src/index.crates.io-1949cf8c6b5b557f/ring-0.17.14/pregenerated" "-Wall" "-Wextra" "-fvisibility=hidden" "-std=c1x" "-Wall" "-Wbad-function-cast" "-Wcast-align" "-Wcast-qual" "-Wconversion" "-Wmissing-field-initializers" "-Wmissing-include-dirs" "-Wnested-externs" "-Wredundant-decls" "-Wshadow" "-Wsign-compare" "-Wsign-conversion" "-Wstrict-prototypes" "-Wundef" "-Wuninitialized" "-gfull" "-DNDEBUG" "-o" "/opt/rustwide/target/aarch64-apple-darwin/debug/build/ring/5ff4bd8b385b48b7/out/25ac62e5b3c53843-curve25519.o" "-c" "/opt/rustwide/cargo-home/registry/src/index.crates.io-1949cf8c6b5b557f/ring-0.17.14/crypto/curve25519/curve25519.c"cargo:warning=cc: error: unrecognized debug output level 'full' [INFO] [stderr] warning: ring@0.17.14: cc: error: unrecognized command-line option '-arch' [INFO] [stderr] warning: ring@0.17.14: cc: error: unrecognized command-line option '-mmacosx-version-min=11.0' [INFO] [stderr] warning: ring@0.17.14: ToolExecError: command did not execute successfully (status code exit status: 1): LC_ALL="C" "cc" "-O0" "-ffunction-sections" "-fdata-sections" "-fPIC" "-g" "-gdwarf-2" "-fno-omit-frame-pointer" "-arch" "arm64" "-mmacosx-version-min=11.0" "-I" "/opt/rustwide/cargo-home/registry/src/index.crates.io-1949cf8c6b5b557f/ring-0.17.14/include" "-I" "/opt/rustwide/cargo-home/registry/src/index.crates.io-1949cf8c6b5b557f/ring-0.17.14/pregenerated" "-Wall" "-Wextra" "-fvisibility=hidden" "-std=c1x" "-Wall" "-Wbad-function-cast" "-Wcast-align" "-Wcast-qual" "-Wconversion" "-Wmissing-field-initializers" "-Wmissing-include-dirs" "-Wnested-externs" "-Wredundant-decls" "-Wshadow" "-Wsign-compare" "-Wsign-conversion" "-Wstrict-prototypes" "-Wundef" "-Wuninitialized" "-gfull" "-DNDEBUG" "-o" "/opt/rustwide/target/aarch64-apple-darwin/debug/build/ring/5ff4bd8b385b48b7/out/0bbbd18bda93c05b-aes_nohw.o" "-c" "/opt/rustwide/cargo-home/registry/src/index.crates.io-1949cf8c6b5b557f/ring-0.17.14/crypto/fipsmodule/aes/aes_nohw.c"cargo:warning=cc: error: unrecognized debug output level 'full' [INFO] [stderr] warning: ring@0.17.14: cc: error: unrecognized command-line option '-arch' [INFO] [stderr] warning: ring@0.17.14: cc: error: unrecognized command-line option '-mmacosx-version-min=11.0' [INFO] [stderr] warning: ring@0.17.14: ToolExecError: command did not execute successfully (status code exit status: 1): LC_ALL="C" "cc" "-O0" "-ffunction-sections" "-fdata-sections" "-fPIC" "-g" "-gdwarf-2" "-fno-omit-frame-pointer" "-arch" "arm64" "-mmacosx-version-min=11.0" "-I" "/opt/rustwide/cargo-home/registry/src/index.crates.io-1949cf8c6b5b557f/ring-0.17.14/include" "-I" "/opt/rustwide/cargo-home/registry/src/index.crates.io-1949cf8c6b5b557f/ring-0.17.14/pregenerated" "-Wall" "-Wextra" "-fvisibility=hidden" "-std=c1x" "-Wall" "-Wbad-function-cast" "-Wcast-align" "-Wcast-qual" "-Wconversion" "-Wmissing-field-initializers" "-Wmissing-include-dirs" "-Wnested-externs" "-Wredundant-decls" "-Wshadow" "-Wsign-compare" "-Wsign-conversion" "-Wstrict-prototypes" "-Wundef" "-Wuninitialized" "-gfull" "-DNDEBUG" "-o" "/opt/rustwide/target/aarch64-apple-darwin/debug/build/ring/5ff4bd8b385b48b7/out/00c879ee3285a50d-montgomery.o" "-c" "/opt/rustwide/cargo-home/registry/src/index.crates.io-1949cf8c6b5b557f/ring-0.17.14/crypto/fipsmodule/bn/montgomery.c"cargo:warning=cc: error: unrecognized debug output level 'full' [INFO] [stderr] warning: ring@0.17.14: cc: error: unrecognized debug output level 'full' [INFO] [stderr] warning: ring@0.17.14: cc: error: unrecognized debug output level 'full' [INFO] [stderr] warning: ring@0.17.14: cc: error: unrecognized command-line option '-arch' [INFO] [stderr] warning: ring@0.17.14: cc: error: unrecognized command-line option '-mmacosx-version-min=11.0' [INFO] [stderr] warning: ring@0.17.14: ToolExecError: command did not execute successfully (status code exit status: 1): LC_ALL="C" "cc" "-O0" "-ffunction-sections" "-fdata-sections" "-fPIC" "-g" "-gdwarf-2" "-fno-omit-frame-pointer" "-arch" "arm64" "-mmacosx-version-min=11.0" "-I" "/opt/rustwide/cargo-home/registry/src/index.crates.io-1949cf8c6b5b557f/ring-0.17.14/include" "-I" "/opt/rustwide/cargo-home/registry/src/index.crates.io-1949cf8c6b5b557f/ring-0.17.14/pregenerated" "-Wall" "-Wextra" "-fvisibility=hidden" "-std=c1x" "-Wall" "-Wbad-function-cast" "-Wcast-align" "-Wcast-qual" "-Wconversion" "-Wmissing-field-initializers" "-Wmissing-include-dirs" "-Wnested-externs" "-Wredundant-decls" "-Wshadow" "-Wsign-compare" "-Wsign-conversion" "-Wstrict-prototypes" "-Wundef" "-Wuninitialized" "-gfull" "-DNDEBUG" "-o" "/opt/rustwide/target/aarch64-apple-darwin/debug/build/ring/5ff4bd8b385b48b7/out/00c879ee3285a50d-montgomery_inv.o" "-c" "/opt/rustwide/cargo-home/registry/src/index.crates.io-1949cf8c6b5b557f/ring-0.17.14/crypto/fipsmodule/bn/montgomery_inv.c"cargo:warning=cc: error: unrecognized command-line option '-arch' [INFO] [stderr] warning: ring@0.17.14: cc: error: unrecognized command-line option '-mmacosx-version-min=11.0' [INFO] [stderr] warning: ring@0.17.14: ToolExecError: command did not execute successfully (status code exit status: 1): LC_ALL="C" "cc" "-O0" "-ffunction-sections" "-fdata-sections" "-fPIC" "-g" "-gdwarf-2" "-fno-omit-frame-pointer" "-arch" "arm64" "-mmacosx-version-min=11.0" "-I" "/opt/rustwide/cargo-home/registry/src/index.crates.io-1949cf8c6b5b557f/ring-0.17.14/include" "-I" "/opt/rustwide/cargo-home/registry/src/index.crates.io-1949cf8c6b5b557f/ring-0.17.14/pregenerated" "-Wall" "-Wextra" "-fvisibility=hidden" "-std=c1x" "-Wall" "-Wbad-function-cast" "-Wcast-align" "-Wcast-qual" "-Wconversion" "-Wmissing-field-initializers" "-Wmissing-include-dirs" "-Wnested-externs" "-Wredundant-decls" "-Wshadow" "-Wsign-compare" "-Wsign-conversion" "-Wstrict-prototypes" "-Wundef" "-Wuninitialized" "-gfull" "-DNDEBUG" "-o" "/opt/rustwide/target/aarch64-apple-darwin/debug/build/ring/5ff4bd8b385b48b7/out/a0330e891e733f4e-ecp_nistz.o" "-c" "/opt/rustwide/cargo-home/registry/src/index.crates.io-1949cf8c6b5b557f/ring-0.17.14/crypto/fipsmodule/ec/ecp_nistz.c"cargo:warning=cc: error: unrecognized command-line option '-arch' [INFO] [stderr] warning: ring@0.17.14: cc: error: unrecognized command-line option '-mmacosx-version-min=11.0' [INFO] [stderr] warning: ring@0.17.14: ToolExecError: command did not execute successfully (status code exit status: 1): LC_ALL="C" "cc" "-O0" "-ffunction-sections" "-fdata-sections" "-fPIC" "-g" "-gdwarf-2" "-fno-omit-frame-pointer" "-arch" "arm64" "-mmacosx-version-min=11.0" "-I" "/opt/rustwide/cargo-home/registry/src/index.crates.io-1949cf8c6b5b557f/ring-0.17.14/include" "-I" "/opt/rustwide/cargo-home/registry/src/index.crates.io-1949cf8c6b5b557f/ring-0.17.14/pregenerated" "-Wall" "-Wextra" "-fvisibility=hidden" "-std=c1x" "-Wall" "-Wbad-function-cast" "-Wcast-align" "-Wcast-qual" "-Wconversion" "-Wmissing-field-initializers" "-Wmissing-include-dirs" "-Wnested-externs" "-Wredundant-decls" "-Wshadow" "-Wsign-compare" "-Wsign-conversion" "-Wstrict-prototypes" "-Wundef" "-Wuninitialized" "-gfull" "-DNDEBUG" "-o" "/opt/rustwide/target/aarch64-apple-darwin/debug/build/ring/5ff4bd8b385b48b7/out/a0330e891e733f4e-gfp_p256.o" "-c" "/opt/rustwide/cargo-home/registry/src/index.crates.io-1949cf8c6b5b557f/ring-0.17.14/crypto/fipsmodule/ec/gfp_p256.c"cargo:warning=cc: error: unrecognized debug output level 'full' [INFO] [stderr] warning: ring@0.17.14: cc: error: unrecognized command-line option '-arch' [INFO] [stderr] warning: ring@0.17.14: cc: error: unrecognized command-line option '-mmacosx-version-min=11.0' [INFO] [stderr] warning: ring@0.17.14: ToolExecError: command did not execute successfully (status code exit status: 1): LC_ALL="C" "cc" "-O0" "-ffunction-sections" "-fdata-sections" "-fPIC" "-g" "-gdwarf-2" "-fno-omit-frame-pointer" "-arch" "arm64" "-mmacosx-version-min=11.0" "-I" "/opt/rustwide/cargo-home/registry/src/index.crates.io-1949cf8c6b5b557f/ring-0.17.14/include" "-I" "/opt/rustwide/cargo-home/registry/src/index.crates.io-1949cf8c6b5b557f/ring-0.17.14/pregenerated" "-Wall" "-Wextra" "-fvisibility=hidden" "-std=c1x" "-Wall" "-Wbad-function-cast" "-Wcast-align" "-Wcast-qual" "-Wconversion" "-Wmissing-field-initializers" "-Wmissing-include-dirs" "-Wnested-externs" "-Wredundant-decls" "-Wshadow" "-Wsign-compare" "-Wsign-conversion" "-Wstrict-prototypes" "-Wundef" "-Wuninitialized" "-gfull" "-DNDEBUG" "-o" "/opt/rustwide/target/aarch64-apple-darwin/debug/build/ring/5ff4bd8b385b48b7/out/a0330e891e733f4e-gfp_p384.o" "-c" "/opt/rustwide/cargo-home/registry/src/index.crates.io-1949cf8c6b5b557f/ring-0.17.14/crypto/fipsmodule/ec/gfp_p384.c"cargo:warning=cc: error: unrecognized debug output level 'full' [INFO] [stderr] warning: ring@0.17.14: cc: error: unrecognized command-line option '-arch' [INFO] [stderr] warning: ring@0.17.14: cc: error: unrecognized command-line option '-mmacosx-version-min=11.0' [INFO] [stderr] warning: ring@0.17.14: ToolExecError: command did not execute successfully (status code exit status: 1): LC_ALL="C" "cc" "-O0" "-ffunction-sections" "-fdata-sections" "-fPIC" "-g" "-gdwarf-2" "-fno-omit-frame-pointer" "-arch" "arm64" "-mmacosx-version-min=11.0" "-I" "/opt/rustwide/cargo-home/registry/src/index.crates.io-1949cf8c6b5b557f/ring-0.17.14/include" "-I" "/opt/rustwide/cargo-home/registry/src/index.crates.io-1949cf8c6b5b557f/ring-0.17.14/pregenerated" "-Wall" "-Wextra" "-fvisibility=hidden" "-std=c1x" "-Wall" "-Wbad-function-cast" "-Wcast-align" "-Wcast-qual" "-Wconversion" "-Wmissing-field-initializers" "-Wmissing-include-dirs" "-Wnested-externs" "-Wredundant-decls" "-Wshadow" "-Wsign-compare" "-Wsign-conversion" "-Wstrict-prototypes" "-Wundef" "-Wuninitialized" "-gfull" "-DNDEBUG" "-o" "/opt/rustwide/target/aarch64-apple-darwin/debug/build/ring/5ff4bd8b385b48b7/out/a0330e891e733f4e-p256.o" "-c" "/opt/rustwide/cargo-home/registry/src/index.crates.io-1949cf8c6b5b557f/ring-0.17.14/crypto/fipsmodule/ec/p256.c"cargo:warning=cc: error: unrecognized debug output level 'full' [INFO] [stderr] warning: ring@0.17.14: cc: error: unrecognized debug output level 'full' [INFO] [stderr] warning: ring@0.17.14: cc: error: unrecognized command-line option '-arch' [INFO] [stderr] warning: ring@0.17.14: cc: error: unrecognized command-line option '-mmacosx-version-min=11.0' [INFO] [stderr] warning: ring@0.17.14: ToolExecError: command did not execute successfully (status code exit status: 1): LC_ALL="C" "cc" "-O0" "-ffunction-sections" "-fdata-sections" "-fPIC" "-g" "-gdwarf-2" "-fno-omit-frame-pointer" "-arch" "arm64" "-mmacosx-version-min=11.0" "-I" "/opt/rustwide/cargo-home/registry/src/index.crates.io-1949cf8c6b5b557f/ring-0.17.14/include" "-I" "/opt/rustwide/cargo-home/registry/src/index.crates.io-1949cf8c6b5b557f/ring-0.17.14/pregenerated" "-Wall" "-Wextra" "-fvisibility=hidden" "-std=c1x" "-Wall" "-Wbad-function-cast" "-Wcast-align" "-Wcast-qual" "-Wconversion" "-Wmissing-field-initializers" "-Wmissing-include-dirs" "-Wnested-externs" "-Wredundant-decls" "-Wshadow" "-Wsign-compare" "-Wsign-conversion" "-Wstrict-prototypes" "-Wundef" "-Wuninitialized" "-gfull" "-DNDEBUG" "-o" "/opt/rustwide/target/aarch64-apple-darwin/debug/build/ring/5ff4bd8b385b48b7/out/aaa1ba3e455ee2e1-limbs.o" "-c" "/opt/rustwide/cargo-home/registry/src/index.crates.io-1949cf8c6b5b557f/ring-0.17.14/crypto/limbs/limbs.c"cargo:warning=cc: error: unrecognized command-line option '-arch' [INFO] [stderr] warning: ring@0.17.14: cc: error: unrecognized command-line option '-mmacosx-version-min=11.0' [INFO] [stderr] warning: ring@0.17.14: ToolExecError: command did not execute successfully (status code exit status: 1): LC_ALL="C" "cc" "-O0" "-ffunction-sections" "-fdata-sections" "-fPIC" "-g" "-gdwarf-2" "-fno-omit-frame-pointer" "-arch" "arm64" "-mmacosx-version-min=11.0" "-I" "/opt/rustwide/cargo-home/registry/src/index.crates.io-1949cf8c6b5b557f/ring-0.17.14/include" "-I" "/opt/rustwide/cargo-home/registry/src/index.crates.io-1949cf8c6b5b557f/ring-0.17.14/pregenerated" "-Wall" "-Wextra" "-fvisibility=hidden" "-std=c1x" "-Wall" "-Wbad-function-cast" "-Wcast-align" "-Wcast-qual" "-Wconversion" "-Wmissing-field-initializers" "-Wmissing-include-dirs" "-Wnested-externs" "-Wredundant-decls" "-Wshadow" "-Wsign-compare" "-Wsign-conversion" "-Wstrict-prototypes" "-Wundef" "-Wuninitialized" "-gfull" "-DNDEBUG" "-o" "/opt/rustwide/target/aarch64-apple-darwin/debug/build/ring/5ff4bd8b385b48b7/out/a4019cc0736b0423-mem.o" "-c" "/opt/rustwide/cargo-home/registry/src/index.crates.io-1949cf8c6b5b557f/ring-0.17.14/crypto/mem.c"cargo:warning=cc: error: unrecognized debug output level 'full' [INFO] [stderr] warning: ring@0.17.14: cc: error: unrecognized command-line option '-arch' [INFO] [stderr] warning: ring@0.17.14: cc: error: unrecognized command-line option '-mmacosx-version-min=11.0' [INFO] [stderr] warning: ring@0.17.14: ToolExecError: command did not execute successfully (status code exit status: 1): LC_ALL="C" "cc" "-O0" "-ffunction-sections" "-fdata-sections" "-fPIC" "-g" "-gdwarf-2" "-fno-omit-frame-pointer" "-arch" "arm64" "-mmacosx-version-min=11.0" "-I" "/opt/rustwide/cargo-home/registry/src/index.crates.io-1949cf8c6b5b557f/ring-0.17.14/include" "-I" "/opt/rustwide/cargo-home/registry/src/index.crates.io-1949cf8c6b5b557f/ring-0.17.14/pregenerated" "-Wall" "-Wextra" "-fvisibility=hidden" "-std=c1x" "-Wall" "-Wbad-function-cast" "-Wcast-align" "-Wcast-qual" "-Wconversion" "-Wmissing-field-initializers" "-Wmissing-include-dirs" "-Wnested-externs" "-Wredundant-decls" "-Wshadow" "-Wsign-compare" "-Wsign-conversion" "-Wstrict-prototypes" "-Wundef" "-Wuninitialized" "-gfull" "-DNDEBUG" "-o" "/opt/rustwide/target/aarch64-apple-darwin/debug/build/ring/5ff4bd8b385b48b7/out/d5a9841f3dc6e253-poly1305.o" "-c" "/opt/rustwide/cargo-home/registry/src/index.crates.io-1949cf8c6b5b557f/ring-0.17.14/crypto/poly1305/poly1305.c"cargo:warning=cc: error: unrecognized debug output level 'full' [INFO] [stderr] warning: ring@0.17.14: cc: error: unrecognized command-line option '-arch' [INFO] [stderr] warning: ring@0.17.14: cc: error: unrecognized command-line option '-mmacosx-version-min=11.0' [INFO] [stderr] warning: ring@0.17.14: ToolExecError: command did not execute successfully (status code exit status: 1): LC_ALL="C" "cc" "-O0" "-ffunction-sections" "-fdata-sections" "-fPIC" "-g" "-gdwarf-2" "-fno-omit-frame-pointer" "-arch" "arm64" "-mmacosx-version-min=11.0" "-I" "/opt/rustwide/cargo-home/registry/src/index.crates.io-1949cf8c6b5b557f/ring-0.17.14/include" "-I" "/opt/rustwide/cargo-home/registry/src/index.crates.io-1949cf8c6b5b557f/ring-0.17.14/pregenerated" "-Wall" "-Wextra" "-fvisibility=hidden" "-std=c1x" "-Wall" "-Wbad-function-cast" "-Wcast-align" "-Wcast-qual" "-Wconversion" "-Wmissing-field-initializers" "-Wmissing-include-dirs" "-Wnested-externs" "-Wredundant-decls" "-Wshadow" "-Wsign-compare" "-Wsign-conversion" "-Wstrict-prototypes" "-Wundef" "-Wuninitialized" "-gfull" "-DNDEBUG" "-o" "/opt/rustwide/target/aarch64-apple-darwin/debug/build/ring/5ff4bd8b385b48b7/out/a0330e891e733f4e-p256-nistz.o" "-c" "/opt/rustwide/cargo-home/registry/src/index.crates.io-1949cf8c6b5b557f/ring-0.17.14/crypto/fipsmodule/ec/p256-nistz.c"cargo:warning=cc: error: unrecognized debug output level 'full' [INFO] [stderr] warning: ring@0.17.14: cc: error: unrecognized command-line option '-arch' [INFO] [stderr] warning: ring@0.17.14: cc: error: unrecognized command-line option '-mmacosx-version-min=11.0' [INFO] [stderr] warning: ring@0.17.14: ToolExecError: command did not execute successfully (status code exit status: 1): LC_ALL="C" "cc" "-O0" "-ffunction-sections" "-fdata-sections" "-fPIC" "-g" "-gdwarf-2" "-fno-omit-frame-pointer" "-arch" "arm64" "-mmacosx-version-min=11.0" "-I" "/opt/rustwide/cargo-home/registry/src/index.crates.io-1949cf8c6b5b557f/ring-0.17.14/include" "-I" "/opt/rustwide/cargo-home/registry/src/index.crates.io-1949cf8c6b5b557f/ring-0.17.14/pregenerated" "-Wall" "-Wextra" "-fvisibility=hidden" "-std=c1x" "-Wall" "-Wbad-function-cast" "-Wcast-align" "-Wcast-qual" "-Wconversion" "-Wmissing-field-initializers" "-Wmissing-include-dirs" "-Wnested-externs" "-Wredundant-decls" "-Wshadow" "-Wsign-compare" "-Wsign-conversion" "-Wstrict-prototypes" "-Wundef" "-Wuninitialized" "-gfull" "-DNDEBUG" "-o" "/opt/rustwide/target/aarch64-apple-darwin/debug/build/ring/5ff4bd8b385b48b7/out/c322a0bcc369f531-chacha-armv8-ios64.o" "-c" "/opt/rustwide/cargo-home/registry/src/index.crates.io-1949cf8c6b5b557f/ring-0.17.14/pregenerated/chacha-armv8-ios64.S"cargo:warning=cc: error: unrecognized debug output level 'full' [INFO] [stderr] warning: ring@0.17.14: cc: error: unrecognized debug output level 'full' [INFO] [stderr] warning: ring@0.17.14: cc: error: unrecognized debug output level 'full' [INFO] [stderr] warning: ring@0.17.14: cc: error: unrecognized command-line option '-arch' [INFO] [stderr] warning: ring@0.17.14: cc: error: unrecognized command-line option '-mmacosx-version-min=11.0' [INFO] [stderr] warning: ring@0.17.14: ToolExecError: command did not execute successfully (status code exit status: 1): LC_ALL="C" "cc" "-O0" "-ffunction-sections" "-fdata-sections" "-fPIC" "-g" "-gdwarf-2" "-fno-omit-frame-pointer" "-arch" "arm64" "-mmacosx-version-min=11.0" "-I" "/opt/rustwide/cargo-home/registry/src/index.crates.io-1949cf8c6b5b557f/ring-0.17.14/include" "-I" "/opt/rustwide/cargo-home/registry/src/index.crates.io-1949cf8c6b5b557f/ring-0.17.14/pregenerated" "-Wall" "-Wextra" "-fvisibility=hidden" "-std=c1x" "-Wall" "-Wbad-function-cast" "-Wcast-align" "-Wcast-qual" "-Wconversion" "-Wmissing-field-initializers" "-Wmissing-include-dirs" "-Wnested-externs" "-Wredundant-decls" "-Wshadow" "-Wsign-compare" "-Wsign-conversion" "-Wstrict-prototypes" "-Wundef" "-Wuninitialized" "-gfull" "-DNDEBUG" "-o" "/opt/rustwide/target/aarch64-apple-darwin/debug/build/ring/5ff4bd8b385b48b7/out/c322a0bcc369f531-chacha20_poly1305_armv8-ios64.o" "-c" "/opt/rustwide/cargo-home/registry/src/index.crates.io-1949cf8c6b5b557f/ring-0.17.14/pregenerated/chacha20_poly1305_armv8-ios64.S"cargo:warning=cc: error: unrecognized command-line option '-arch' [INFO] [stderr] warning: ring@0.17.14: cc: error: unrecognized command-line option '-mmacosx-version-min=11.0' [INFO] [stderr] warning: ring@0.17.14: ToolExecError: command did not execute successfully (status code exit status: 1): LC_ALL="C" "cc" "-O0" "-ffunction-sections" "-fdata-sections" "-fPIC" "-g" "-gdwarf-2" "-fno-omit-frame-pointer" "-arch" "arm64" "-mmacosx-version-min=11.0" "-I" "/opt/rustwide/cargo-home/registry/src/index.crates.io-1949cf8c6b5b557f/ring-0.17.14/include" "-I" "/opt/rustwide/cargo-home/registry/src/index.crates.io-1949cf8c6b5b557f/ring-0.17.14/pregenerated" "-Wall" "-Wextra" "-fvisibility=hidden" "-std=c1x" "-Wall" "-Wbad-function-cast" "-Wcast-align" "-Wcast-qual" "-Wconversion" "-Wmissing-field-initializers" "-Wmissing-include-dirs" "-Wnested-externs" "-Wredundant-decls" "-Wshadow" "-Wsign-compare" "-Wsign-conversion" "-Wstrict-prototypes" "-Wundef" "-Wuninitialized" "-gfull" "-DNDEBUG" "-o" "/opt/rustwide/target/aarch64-apple-darwin/debug/build/ring/5ff4bd8b385b48b7/out/c322a0bcc369f531-aesv8-armx-ios64.o" "-c" "/opt/rustwide/cargo-home/registry/src/index.crates.io-1949cf8c6b5b557f/ring-0.17.14/pregenerated/aesv8-armx-ios64.S"cargo:warning=cc: error: unrecognized command-line option '-arch' [INFO] [stderr] warning: ring@0.17.14: cc: error: unrecognized command-line option '-mmacosx-version-min=11.0' [INFO] [stderr] warning: ring@0.17.14: ToolExecError: command did not execute successfully (status code exit status: 1): LC_ALL="C" "cc" "-O0" "-ffunction-sections" "-fdata-sections" "-fPIC" "-g" "-gdwarf-2" "-fno-omit-frame-pointer" "-arch" "arm64" "-mmacosx-version-min=11.0" "-I" "/opt/rustwide/cargo-home/registry/src/index.crates.io-1949cf8c6b5b557f/ring-0.17.14/include" "-I" "/opt/rustwide/cargo-home/registry/src/index.crates.io-1949cf8c6b5b557f/ring-0.17.14/pregenerated" "-Wall" "-Wextra" "-fvisibility=hidden" "-std=c1x" "-Wall" "-Wbad-function-cast" "-Wcast-align" "-Wcast-qual" "-Wconversion" "-Wmissing-field-initializers" "-Wmissing-include-dirs" "-Wnested-externs" "-Wredundant-decls" "-Wshadow" "-Wsign-compare" "-Wsign-conversion" "-Wstrict-prototypes" "-Wundef" "-Wuninitialized" "-gfull" "-DNDEBUG" "-o" "/opt/rustwide/target/aarch64-apple-darwin/debug/build/ring/5ff4bd8b385b48b7/out/c322a0bcc369f531-aesv8-gcm-armv8-ios64.o" "-c" "/opt/rustwide/cargo-home/registry/src/index.crates.io-1949cf8c6b5b557f/ring-0.17.14/pregenerated/aesv8-gcm-armv8-ios64.S"cargo:warning=cc: error: unrecognized debug output level 'full' [INFO] [stderr] warning: ring@0.17.14: cc: error: unrecognized command-line option '-arch' [INFO] [stderr] warning: ring@0.17.14: cc: error: unrecognized command-line option '-mmacosx-version-min=11.0' [INFO] [stderr] warning: ring@0.17.14: ToolExecError: command did not execute successfully (status code exit status: 1): LC_ALL="C" "cc" "-O0" "-ffunction-sections" "-fdata-sections" "-fPIC" "-g" "-gdwarf-2" "-fno-omit-frame-pointer" "-arch" "arm64" "-mmacosx-version-min=11.0" "-I" "/opt/rustwide/cargo-home/registry/src/index.crates.io-1949cf8c6b5b557f/ring-0.17.14/include" "-I" "/opt/rustwide/cargo-home/registry/src/index.crates.io-1949cf8c6b5b557f/ring-0.17.14/pregenerated" "-Wall" "-Wextra" "-fvisibility=hidden" "-std=c1x" "-Wall" "-Wbad-function-cast" "-Wcast-align" "-Wcast-qual" "-Wconversion" "-Wmissing-field-initializers" "-Wmissing-include-dirs" "-Wnested-externs" "-Wredundant-decls" "-Wshadow" "-Wsign-compare" "-Wsign-conversion" "-Wstrict-prototypes" "-Wundef" "-Wuninitialized" "-gfull" "-DNDEBUG" "-o" "/opt/rustwide/target/aarch64-apple-darwin/debug/build/ring/5ff4bd8b385b48b7/out/c322a0bcc369f531-ghash-neon-armv8-ios64.o" "-c" "/opt/rustwide/cargo-home/registry/src/index.crates.io-1949cf8c6b5b557f/ring-0.17.14/pregenerated/ghash-neon-armv8-ios64.S"cargo:warning=cc: error: unrecognized debug output level 'full' [INFO] [stderr] warning: ring@0.17.14: cc: error: unrecognized command-line option '-arch' [INFO] [stderr] warning: ring@0.17.14: cc: error: unrecognized command-line option '-mmacosx-version-min=11.0' [INFO] [stderr] warning: ring@0.17.14: ToolExecError: command did not execute successfully (status code exit status: 1): LC_ALL="C" "cc" "-O0" "-ffunction-sections" "-fdata-sections" "-fPIC" "-g" "-gdwarf-2" "-fno-omit-frame-pointer" "-arch" "arm64" "-mmacosx-version-min=11.0" "-I" "/opt/rustwide/cargo-home/registry/src/index.crates.io-1949cf8c6b5b557f/ring-0.17.14/include" "-I" "/opt/rustwide/cargo-home/registry/src/index.crates.io-1949cf8c6b5b557f/ring-0.17.14/pregenerated" "-Wall" "-Wextra" "-fvisibility=hidden" "-std=c1x" "-Wall" "-Wbad-function-cast" "-Wcast-align" "-Wcast-qual" "-Wconversion" "-Wmissing-field-initializers" "-Wmissing-include-dirs" "-Wnested-externs" "-Wredundant-decls" "-Wshadow" "-Wsign-compare" "-Wsign-conversion" "-Wstrict-prototypes" "-Wundef" "-Wuninitialized" "-gfull" "-DNDEBUG" "-o" "/opt/rustwide/target/aarch64-apple-darwin/debug/build/ring/5ff4bd8b385b48b7/out/c322a0bcc369f531-ghashv8-armx-ios64.o" "-c" "/opt/rustwide/cargo-home/registry/src/index.crates.io-1949cf8c6b5b557f/ring-0.17.14/pregenerated/ghashv8-armx-ios64.S"cargo:warning=cc: error: unrecognized debug output level 'full' [INFO] [stderr] warning: ring@0.17.14: cc: error: unrecognized command-line option '-arch' [INFO] [stderr] warning: ring@0.17.14: cc: error: unrecognized command-line option '-mmacosx-version-min=11.0' [INFO] [stderr] warning: ring@0.17.14: ToolExecError: command did not execute successfully (status code exit status: 1): LC_ALL="C" "cc" "-O0" "-ffunction-sections" "-fdata-sections" "-fPIC" "-g" "-gdwarf-2" "-fno-omit-frame-pointer" "-arch" "arm64" "-mmacosx-version-min=11.0" "-I" "/opt/rustwide/cargo-home/registry/src/index.crates.io-1949cf8c6b5b557f/ring-0.17.14/include" "-I" "/opt/rustwide/cargo-home/registry/src/index.crates.io-1949cf8c6b5b557f/ring-0.17.14/pregenerated" "-Wall" "-Wextra" "-fvisibility=hidden" "-std=c1x" "-Wall" "-Wbad-function-cast" "-Wcast-align" "-Wcast-qual" "-Wconversion" "-Wmissing-field-initializers" "-Wmissing-include-dirs" "-Wnested-externs" "-Wredundant-decls" "-Wshadow" "-Wsign-compare" "-Wsign-conversion" "-Wstrict-prototypes" "-Wundef" "-Wuninitialized" "-gfull" "-DNDEBUG" "-o" "/opt/rustwide/target/aarch64-apple-darwin/debug/build/ring/5ff4bd8b385b48b7/out/c322a0bcc369f531-vpaes-armv8-ios64.o" "-c" "/opt/rustwide/cargo-home/registry/src/index.crates.io-1949cf8c6b5b557f/ring-0.17.14/pregenerated/vpaes-armv8-ios64.S"cargo:warning=cc: error: unrecognized debug output level 'full' [INFO] [stderr] warning: ring@0.17.14: cc: error: unrecognized command-line option '-arch' [INFO] [stderr] warning: ring@0.17.14: cc: error: unrecognized command-line option '-mmacosx-version-min=11.0' [INFO] [stderr] warning: ring@0.17.14: ToolExecError: command did not execute successfully (status code exit status: 1): LC_ALL="C" "cc" "-O0" "-ffunction-sections" "-fdata-sections" "-fPIC" "-g" "-gdwarf-2" "-fno-omit-frame-pointer" "-arch" "arm64" "-mmacosx-version-min=11.0" "-I" "/opt/rustwide/cargo-home/registry/src/index.crates.io-1949cf8c6b5b557f/ring-0.17.14/include" "-I" "/opt/rustwide/cargo-home/registry/src/index.crates.io-1949cf8c6b5b557f/ring-0.17.14/pregenerated" "-Wall" "-Wextra" "-fvisibility=hidden" "-std=c1x" "-Wall" "-Wbad-function-cast" "-Wcast-align" "-Wcast-qual" "-Wconversion" "-Wmissing-field-initializers" "-Wmissing-include-dirs" "-Wnested-externs" "-Wredundant-decls" "-Wshadow" "-Wsign-compare" "-Wsign-conversion" "-Wstrict-prototypes" "-Wundef" "-Wuninitialized" "-gfull" "-DNDEBUG" "-o" "/opt/rustwide/target/aarch64-apple-darwin/debug/build/ring/5ff4bd8b385b48b7/out/c322a0bcc369f531-armv8-mont-ios64.o" "-c" "/opt/rustwide/cargo-home/registry/src/index.crates.io-1949cf8c6b5b557f/ring-0.17.14/pregenerated/armv8-mont-ios64.S"cargo:warning=cc: error: unrecognized debug output level 'full' [INFO] [stderr] warning: ring@0.17.14: cc: error: unrecognized command-line option '-arch' [INFO] [stderr] warning: ring@0.17.14: cc: error: unrecognized command-line option '-mmacosx-version-min=11.0' [INFO] [stderr] warning: ring@0.17.14: ToolExecError: command did not execute successfully (status code exit status: 1): LC_ALL="C" "cc" "-O0" "-ffunction-sections" "-fdata-sections" "-fPIC" "-g" "-gdwarf-2" "-fno-omit-frame-pointer" "-arch" "arm64" "-mmacosx-version-min=11.0" "-I" "/opt/rustwide/cargo-home/registry/src/index.crates.io-1949cf8c6b5b557f/ring-0.17.14/include" "-I" "/opt/rustwide/cargo-home/registry/src/index.crates.io-1949cf8c6b5b557f/ring-0.17.14/pregenerated" "-Wall" "-Wextra" "-fvisibility=hidden" "-std=c1x" "-Wall" "-Wbad-function-cast" "-Wcast-align" "-Wcast-qual" "-Wconversion" "-Wmissing-field-initializers" "-Wmissing-include-dirs" "-Wnested-externs" "-Wredundant-decls" "-Wshadow" "-Wsign-compare" "-Wsign-conversion" "-Wstrict-prototypes" "-Wundef" "-Wuninitialized" "-gfull" "-DNDEBUG" "-o" "/opt/rustwide/target/aarch64-apple-darwin/debug/build/ring/5ff4bd8b385b48b7/out/c322a0bcc369f531-p256-armv8-asm-ios64.o" "-c" "/opt/rustwide/cargo-home/registry/src/index.crates.io-1949cf8c6b5b557f/ring-0.17.14/pregenerated/p256-armv8-asm-ios64.S"cargo:warning=cc: error: unrecognized debug output level 'full' [INFO] [stderr] warning: ring@0.17.14: cc: error: unrecognized command-line option '-arch' [INFO] [stderr] warning: ring@0.17.14: cc: error: unrecognized command-line option '-mmacosx-version-min=11.0' [INFO] [stderr] warning: ring@0.17.14: ToolExecError: command did not execute successfully (status code exit status: 1): LC_ALL="C" "cc" "-O0" "-ffunction-sections" "-fdata-sections" "-fPIC" "-g" "-gdwarf-2" "-fno-omit-frame-pointer" "-arch" "arm64" "-mmacosx-version-min=11.0" "-I" "/opt/rustwide/cargo-home/registry/src/index.crates.io-1949cf8c6b5b557f/ring-0.17.14/include" "-I" "/opt/rustwide/cargo-home/registry/src/index.crates.io-1949cf8c6b5b557f/ring-0.17.14/pregenerated" "-Wall" "-Wextra" "-fvisibility=hidden" "-std=c1x" "-Wall" "-Wbad-function-cast" "-Wcast-align" "-Wcast-qual" "-Wconversion" "-Wmissing-field-initializers" "-Wmissing-include-dirs" "-Wnested-externs" "-Wredundant-decls" "-Wshadow" "-Wsign-compare" "-Wsign-conversion" "-Wstrict-prototypes" "-Wundef" "-Wuninitialized" "-gfull" "-DNDEBUG" "-o" "/opt/rustwide/target/aarch64-apple-darwin/debug/build/ring/5ff4bd8b385b48b7/out/c322a0bcc369f531-sha512-armv8-ios64.o" "-c" "/opt/rustwide/cargo-home/registry/src/index.crates.io-1949cf8c6b5b557f/ring-0.17.14/pregenerated/sha512-armv8-ios64.S"cargo:warning=cc: error: unrecognized debug output level 'full' [INFO] [stderr] warning: ring@0.17.14: cc: error: unrecognized command-line option '-arch' [INFO] [stderr] warning: ring@0.17.14: cc: error: unrecognized command-line option '-mmacosx-version-min=11.0' [INFO] [stderr] warning: ring@0.17.14: ToolExecError: command did not execute successfully (status code exit status: 1): LC_ALL="C" "cc" "-O0" "-ffunction-sections" "-fdata-sections" "-fPIC" "-g" "-gdwarf-2" "-fno-omit-frame-pointer" "-arch" "arm64" "-mmacosx-version-min=11.0" "-I" "/opt/rustwide/cargo-home/registry/src/index.crates.io-1949cf8c6b5b557f/ring-0.17.14/include" "-I" "/opt/rustwide/cargo-home/registry/src/index.crates.io-1949cf8c6b5b557f/ring-0.17.14/pregenerated" "-Wall" "-Wextra" "-fvisibility=hidden" "-std=c1x" "-Wall" "-Wbad-function-cast" "-Wcast-align" "-Wcast-qual" "-Wconversion" "-Wmissing-field-initializers" "-Wmissing-include-dirs" "-Wnested-externs" "-Wredundant-decls" "-Wshadow" "-Wsign-compare" "-Wsign-conversion" "-Wstrict-prototypes" "-Wundef" "-Wuninitialized" "-gfull" "-DNDEBUG" "-o" "/opt/rustwide/target/aarch64-apple-darwin/debug/build/ring/5ff4bd8b385b48b7/out/c322a0bcc369f531-sha256-armv8-ios64.o" "-c" "/opt/rustwide/cargo-home/registry/src/index.crates.io-1949cf8c6b5b557f/ring-0.17.14/pregenerated/sha256-armv8-ios64.S" [INFO] [stderr] error: failed to run custom build command for `ring v0.17.14` [INFO] [stderr] [INFO] [stderr] Caused by: [INFO] [stderr] process didn't exit successfully: `/opt/rustwide/target/debug/build/ring/66d17120a0df914c/out/build_script_build` (exit status: 1) [INFO] [stderr] --- stdout [INFO] [stderr] cargo:rerun-if-env-changed=CARGO_MANIFEST_DIR [INFO] [stderr] cargo:rerun-if-env-changed=CARGO_PKG_NAME [INFO] [stderr] cargo:rerun-if-env-changed=CARGO_PKG_VERSION_MAJOR [INFO] [stderr] cargo:rerun-if-env-changed=CARGO_PKG_VERSION_MINOR [INFO] [stderr] cargo:rerun-if-env-changed=CARGO_PKG_VERSION_PATCH [INFO] [stderr] cargo:rerun-if-env-changed=CARGO_PKG_VERSION_PRE [INFO] [stderr] cargo:rerun-if-env-changed=CARGO_MANIFEST_LINKS [INFO] [stderr] cargo:rerun-if-env-changed=RING_PREGENERATE_ASM [INFO] [stderr] cargo:rerun-if-env-changed=OUT_DIR [INFO] [stderr] cargo:rerun-if-env-changed=CARGO_CFG_TARGET_ARCH [INFO] [stderr] cargo:rerun-if-env-changed=CARGO_CFG_TARGET_OS [INFO] [stderr] cargo:rerun-if-env-changed=CARGO_CFG_TARGET_ENV [INFO] [stderr] cargo:rerun-if-env-changed=CARGO_CFG_TARGET_ENDIAN [INFO] [stderr] cargo:rerun-if-env-changed=CC_aarch64-apple-darwin [INFO] [stderr] CC_aarch64-apple-darwin = None [INFO] [stderr] cargo:rerun-if-env-changed=CC_aarch64_apple_darwin [INFO] [stderr] CC_aarch64_apple_darwin = None [INFO] [stderr] cargo:rerun-if-env-changed=TARGET_CC [INFO] [stderr] TARGET_CC = None [INFO] [stderr] cargo:rerun-if-env-changed=CC [INFO] [stderr] CC = None [INFO] [stderr] cargo:rerun-if-env-changed=CROSS_COMPILE [INFO] [stderr] CROSS_COMPILE = None [INFO] [stderr] cargo:rerun-if-env-changed=CC_ENABLE_DEBUG_OUTPUT [INFO] [stderr] cargo:rerun-if-env-changed=CRATE_CC_NO_DEFAULTS [INFO] [stderr] CRATE_CC_NO_DEFAULTS = None [INFO] [stderr] cargo:rerun-if-env-changed=CRATE_CC_NO_DEFAULTS [INFO] [stderr] CRATE_CC_NO_DEFAULTS = None [INFO] [stderr] cargo:rerun-if-env-changed=MACOSX_DEPLOYMENT_TARGET [INFO] [stderr] MACOSX_DEPLOYMENT_TARGET = None [INFO] [stderr] cargo:rerun-if-env-changed=CC_ENABLE_DEBUG_OUTPUT [INFO] [stderr] cargo:rerun-if-env-changed=CFLAGS [INFO] [stderr] CFLAGS = None [INFO] [stderr] cargo:rerun-if-env-changed=TARGET_CFLAGS [INFO] [stderr] TARGET_CFLAGS = None [INFO] [stderr] cargo:rerun-if-env-changed=CFLAGS_aarch64_apple_darwin [INFO] [stderr] CFLAGS_aarch64_apple_darwin = None [INFO] [stderr] cargo:rerun-if-env-changed=CFLAGS_aarch64-apple-darwin [INFO] [stderr] CFLAGS_aarch64-apple-darwin = None [INFO] [stderr] cargo:rerun-if-env-changed=CFLAGS [INFO] [stderr] CFLAGS = None [INFO] [stderr] cargo:rerun-if-env-changed=TARGET_CFLAGS [INFO] [stderr] TARGET_CFLAGS = None [INFO] [stderr] cargo:rerun-if-env-changed=CFLAGS_aarch64_apple_darwin [INFO] [stderr] CFLAGS_aarch64_apple_darwin = None [INFO] [stderr] cargo:rerun-if-env-changed=CFLAGS_aarch64-apple-darwin [INFO] [stderr] CFLAGS_aarch64-apple-darwin = None [INFO] [stderr] cargo:warning=cc: error: unrecognized debug output level 'full' [INFO] [stderr] cargo:warning=cc: error: unrecognized command-line option '-arch' [INFO] [stderr] cargo:warning=cc: error: unrecognized command-line option '-mmacosx-version-min=11.0' [INFO] [stderr] exit status: 1 [INFO] [stderr] cargo:warning=ToolExecError: command did not execute successfully (status code exit status: 1): LC_ALL="C" "cc" "-O0" "-ffunction-sections" "-fdata-sections" "-fPIC" "-g" "-gdwarf-2" "-fno-omit-frame-pointer" "-arch" "arm64" "-mmacosx-version-min=11.0" "-I" "/opt/rustwide/cargo-home/registry/src/index.crates.io-1949cf8c6b5b557f/ring-0.17.14/include" "-I" "/opt/rustwide/cargo-home/registry/src/index.crates.io-1949cf8c6b5b557f/ring-0.17.14/pregenerated" "-Wall" "-Wextra" "-fvisibility=hidden" "-std=c1x" "-Wall" "-Wbad-function-cast" "-Wcast-align" "-Wcast-qual" "-Wconversion" "-Wmissing-field-initializers" "-Wmissing-include-dirs" "-Wnested-externs" "-Wredundant-decls" "-Wshadow" "-Wsign-compare" "-Wsign-conversion" "-Wstrict-prototypes" "-Wundef" "-Wuninitialized" "-gfull" "-DNDEBUG" "-o" "/opt/rustwide/target/aarch64-apple-darwin/debug/build/ring/5ff4bd8b385b48b7/out/25ac62e5b3c53843-curve25519.o" "-c" "/opt/rustwide/cargo-home/registry/src/index.crates.io-1949cf8c6b5b557f/ring-0.17.14/crypto/curve25519/curve25519.c"cargo:warning=cc: error: unrecognized debug output level 'full' [INFO] [stderr] cargo:warning=cc: error: unrecognized command-line option '-arch' [INFO] [stderr] cargo:warning=cc: error: unrecognized command-line option '-mmacosx-version-min=11.0' [INFO] [stderr] [INFO] [stderr] exit status: 1 [INFO] [stderr] cargo:warning=ToolExecError: command did not execute successfully (status code exit status: 1): LC_ALL="C" "cc" "-O0" "-ffunction-sections" "-fdata-sections" "-fPIC" "-g" "-gdwarf-2" "-fno-omit-frame-pointer" "-arch" "arm64" "-mmacosx-version-min=11.0" "-I" "/opt/rustwide/cargo-home/registry/src/index.crates.io-1949cf8c6b5b557f/ring-0.17.14/include" "-I" "/opt/rustwide/cargo-home/registry/src/index.crates.io-1949cf8c6b5b557f/ring-0.17.14/pregenerated" "-Wall" "-Wextra" "-fvisibility=hidden" "-std=c1x" "-Wall" "-Wbad-function-cast" "-Wcast-align" "-Wcast-qual" "-Wconversion" "-Wmissing-field-initializers" "-Wmissing-include-dirs" "-Wnested-externs" "-Wredundant-decls" "-Wshadow" "-Wsign-compare" "-Wsign-conversion" "-Wstrict-prototypes" "-Wundef" "-Wuninitialized" "-gfull" "-DNDEBUG" "-o" "/opt/rustwide/target/aarch64-apple-darwin/debug/build/ring/5ff4bd8b385b48b7/out/0bbbd18bda93c05b-aes_nohw.o" "-c" "/opt/rustwide/cargo-home/registry/src/index.crates.io-1949cf8c6b5b557f/ring-0.17.14/crypto/fipsmodule/aes/aes_nohw.c"cargo:warning=cc: error: unrecognized debug output level 'full' [INFO] [stderr] cargo:warning=cc: error: unrecognized command-line option '-arch' [INFO] [stderr] cargo:warning=cc: error: unrecognized command-line option '-mmacosx-version-min=11.0' [INFO] [stderr] [INFO] [stderr] exit status: 1 [INFO] [stderr] cargo:warning=ToolExecError: command did not execute successfully (status code exit status: 1): LC_ALL="C" "cc" "-O0" "-ffunction-sections" "-fdata-sections" "-fPIC" "-g" "-gdwarf-2" "-fno-omit-frame-pointer" "-arch" "arm64" "-mmacosx-version-min=11.0" "-I" "/opt/rustwide/cargo-home/registry/src/index.crates.io-1949cf8c6b5b557f/ring-0.17.14/include" "-I" "/opt/rustwide/cargo-home/registry/src/index.crates.io-1949cf8c6b5b557f/ring-0.17.14/pregenerated" "-Wall" "-Wextra" "-fvisibility=hidden" "-std=c1x" "-Wall" "-Wbad-function-cast" "-Wcast-align" "-Wcast-qual" "-Wconversion" "-Wmissing-field-initializers" "-Wmissing-include-dirs" "-Wnested-externs" "-Wredundant-decls" "-Wshadow" "-Wsign-compare" "-Wsign-conversion" "-Wstrict-prototypes" "-Wundef" "-Wuninitialized" "-gfull" "-DNDEBUG" "-o" "/opt/rustwide/target/aarch64-apple-darwin/debug/build/ring/5ff4bd8b385b48b7/out/00c879ee3285a50d-montgomery.o" "-c" "/opt/rustwide/cargo-home/registry/src/index.crates.io-1949cf8c6b5b557f/ring-0.17.14/crypto/fipsmodule/bn/montgomery.c"cargo:warning=cc: error: unrecognized debug output level 'full' [INFO] [stderr] cargo:warning=cc: error: unrecognized debug output level 'full' [INFO] [stderr] cargo:warning=cc: error: unrecognized debug output level 'full' [INFO] [stderr] cargo:warning=cc: error: unrecognized command-line option '-arch' [INFO] [stderr] cargo:warning=cc: error: unrecognized command-line option '-mmacosx-version-min=11.0' [INFO] [stderr] [INFO] [stderr] exit status: 1 [INFO] [stderr] cargo:warning=ToolExecError: command did not execute successfully (status code exit status: 1): LC_ALL="C" "cc" "-O0" "-ffunction-sections" "-fdata-sections" "-fPIC" "-g" "-gdwarf-2" "-fno-omit-frame-pointer" "-arch" "arm64" "-mmacosx-version-min=11.0" "-I" "/opt/rustwide/cargo-home/registry/src/index.crates.io-1949cf8c6b5b557f/ring-0.17.14/include" "-I" "/opt/rustwide/cargo-home/registry/src/index.crates.io-1949cf8c6b5b557f/ring-0.17.14/pregenerated" "-Wall" "-Wextra" "-fvisibility=hidden" "-std=c1x" "-Wall" "-Wbad-function-cast" "-Wcast-align" "-Wcast-qual" "-Wconversion" "-Wmissing-field-initializers" "-Wmissing-include-dirs" "-Wnested-externs" "-Wredundant-decls" "-Wshadow" "-Wsign-compare" "-Wsign-conversion" "-Wstrict-prototypes" "-Wundef" "-Wuninitialized" "-gfull" "-DNDEBUG" "-o" "/opt/rustwide/target/aarch64-apple-darwin/debug/build/ring/5ff4bd8b385b48b7/out/00c879ee3285a50d-montgomery_inv.o" "-c" "/opt/rustwide/cargo-home/registry/src/index.crates.io-1949cf8c6b5b557f/ring-0.17.14/crypto/fipsmodule/bn/montgomery_inv.c"cargo:warning=cc: error: unrecognized command-line option '-arch' [INFO] [stderr] cargo:warning=cc: error: unrecognized command-line option '-mmacosx-version-min=11.0' [INFO] [stderr] [INFO] [stderr] exit status: 1 [INFO] [stderr] cargo:warning=ToolExecError: command did not execute successfully (status code exit status: 1): LC_ALL="C" "cc" "-O0" "-ffunction-sections" "-fdata-sections" "-fPIC" "-g" "-gdwarf-2" "-fno-omit-frame-pointer" "-arch" "arm64" "-mmacosx-version-min=11.0" "-I" "/opt/rustwide/cargo-home/registry/src/index.crates.io-1949cf8c6b5b557f/ring-0.17.14/include" "-I" "/opt/rustwide/cargo-home/registry/src/index.crates.io-1949cf8c6b5b557f/ring-0.17.14/pregenerated" "-Wall" "-Wextra" "-fvisibility=hidden" "-std=c1x" "-Wall" "-Wbad-function-cast" "-Wcast-align" "-Wcast-qual" "-Wconversion" "-Wmissing-field-initializers" "-Wmissing-include-dirs" "-Wnested-externs" "-Wredundant-decls" "-Wshadow" "-Wsign-compare" "-Wsign-conversion" "-Wstrict-prototypes" "-Wundef" "-Wuninitialized" "-gfull" "-DNDEBUG" "-o" "/opt/rustwide/target/aarch64-apple-darwin/debug/build/ring/5ff4bd8b385b48b7/out/a0330e891e733f4e-ecp_nistz.o" "-c" "/opt/rustwide/cargo-home/registry/src/index.crates.io-1949cf8c6b5b557f/ring-0.17.14/crypto/fipsmodule/ec/ecp_nistz.c"cargo:warning=cc: error: unrecognized command-line option '-arch' [INFO] [stderr] cargo:warning=cc: error: unrecognized command-line option '-mmacosx-version-min=11.0' [INFO] [stderr] [INFO] [stderr] exit status: 1 [INFO] [stderr] cargo:warning=ToolExecError: command did not execute successfully (status code exit status: 1): LC_ALL="C" "cc" "-O0" "-ffunction-sections" "-fdata-sections" "-fPIC" "-g" "-gdwarf-2" "-fno-omit-frame-pointer" "-arch" "arm64" "-mmacosx-version-min=11.0" "-I" "/opt/rustwide/cargo-home/registry/src/index.crates.io-1949cf8c6b5b557f/ring-0.17.14/include" "-I" "/opt/rustwide/cargo-home/registry/src/index.crates.io-1949cf8c6b5b557f/ring-0.17.14/pregenerated" "-Wall" "-Wextra" "-fvisibility=hidden" "-std=c1x" "-Wall" "-Wbad-function-cast" "-Wcast-align" "-Wcast-qual" "-Wconversion" "-Wmissing-field-initializers" "-Wmissing-include-dirs" "-Wnested-externs" "-Wredundant-decls" "-Wshadow" "-Wsign-compare" "-Wsign-conversion" "-Wstrict-prototypes" "-Wundef" "-Wuninitialized" "-gfull" "-DNDEBUG" "-o" "/opt/rustwide/target/aarch64-apple-darwin/debug/build/ring/5ff4bd8b385b48b7/out/a0330e891e733f4e-gfp_p256.o" "-c" "/opt/rustwide/cargo-home/registry/src/index.crates.io-1949cf8c6b5b557f/ring-0.17.14/crypto/fipsmodule/ec/gfp_p256.c"cargo:warning=cc: error: unrecognized debug output level 'full' [INFO] [stderr] cargo:warning=cc: error: unrecognized command-line option '-arch' [INFO] [stderr] cargo:warning=cc: error: unrecognized command-line option '-mmacosx-version-min=11.0' [INFO] [stderr] [INFO] [stderr] exit status: 1 [INFO] [stderr] cargo:warning=ToolExecError: command did not execute successfully (status code exit status: 1): LC_ALL="C" "cc" "-O0" "-ffunction-sections" "-fdata-sections" "-fPIC" "-g" "-gdwarf-2" "-fno-omit-frame-pointer" "-arch" "arm64" "-mmacosx-version-min=11.0" "-I" "/opt/rustwide/cargo-home/registry/src/index.crates.io-1949cf8c6b5b557f/ring-0.17.14/include" "-I" "/opt/rustwide/cargo-home/registry/src/index.crates.io-1949cf8c6b5b557f/ring-0.17.14/pregenerated" "-Wall" "-Wextra" "-fvisibility=hidden" "-std=c1x" "-Wall" "-Wbad-function-cast" "-Wcast-align" "-Wcast-qual" "-Wconversion" "-Wmissing-field-initializers" "-Wmissing-include-dirs" "-Wnested-externs" "-Wredundant-decls" "-Wshadow" "-Wsign-compare" "-Wsign-conversion" "-Wstrict-prototypes" "-Wundef" "-Wuninitialized" "-gfull" "-DNDEBUG" "-o" "/opt/rustwide/target/aarch64-apple-darwin/debug/build/ring/5ff4bd8b385b48b7/out/a0330e891e733f4e-gfp_p384.o" "-c" "/opt/rustwide/cargo-home/registry/src/index.crates.io-1949cf8c6b5b557f/ring-0.17.14/crypto/fipsmodule/ec/gfp_p384.c"cargo:warning=cc: error: unrecognized debug output level 'full' [INFO] [stderr] cargo:warning=cc: error: unrecognized command-line option '-arch' [INFO] [stderr] cargo:warning=cc: error: unrecognized command-line option '-mmacosx-version-min=11.0' [INFO] [stderr] [INFO] [stderr] exit status: 1 [INFO] [stderr] cargo:warning=ToolExecError: command did not execute successfully (status code exit status: 1): LC_ALL="C" "cc" "-O0" "-ffunction-sections" "-fdata-sections" "-fPIC" "-g" "-gdwarf-2" "-fno-omit-frame-pointer" "-arch" "arm64" "-mmacosx-version-min=11.0" "-I" "/opt/rustwide/cargo-home/registry/src/index.crates.io-1949cf8c6b5b557f/ring-0.17.14/include" "-I" "/opt/rustwide/cargo-home/registry/src/index.crates.io-1949cf8c6b5b557f/ring-0.17.14/pregenerated" "-Wall" "-Wextra" "-fvisibility=hidden" "-std=c1x" "-Wall" "-Wbad-function-cast" "-Wcast-align" "-Wcast-qual" "-Wconversion" "-Wmissing-field-initializers" "-Wmissing-include-dirs" "-Wnested-externs" "-Wredundant-decls" "-Wshadow" "-Wsign-compare" "-Wsign-conversion" "-Wstrict-prototypes" "-Wundef" "-Wuninitialized" "-gfull" "-DNDEBUG" "-o" "/opt/rustwide/target/aarch64-apple-darwin/debug/build/ring/5ff4bd8b385b48b7/out/a0330e891e733f4e-p256.o" "-c" "/opt/rustwide/cargo-home/registry/src/index.crates.io-1949cf8c6b5b557f/ring-0.17.14/crypto/fipsmodule/ec/p256.c"cargo:warning=cc: error: unrecognized debug output level 'full' [INFO] [stderr] cargo:warning=cc: error: unrecognized debug output level 'full' [INFO] [stderr] cargo:warning=cc: error: unrecognized command-line option '-arch' [INFO] [stderr] cargo:warning=cc: error: unrecognized command-line option '-mmacosx-version-min=11.0' [INFO] [stderr] [INFO] [stderr] exit status: 1 [INFO] [stderr] cargo:warning=ToolExecError: command did not execute successfully (status code exit status: 1): LC_ALL="C" "cc" "-O0" "-ffunction-sections" "-fdata-sections" "-fPIC" "-g" "-gdwarf-2" "-fno-omit-frame-pointer" "-arch" "arm64" "-mmacosx-version-min=11.0" "-I" "/opt/rustwide/cargo-home/registry/src/index.crates.io-1949cf8c6b5b557f/ring-0.17.14/include" "-I" "/opt/rustwide/cargo-home/registry/src/index.crates.io-1949cf8c6b5b557f/ring-0.17.14/pregenerated" "-Wall" "-Wextra" "-fvisibility=hidden" "-std=c1x" "-Wall" "-Wbad-function-cast" "-Wcast-align" "-Wcast-qual" "-Wconversion" "-Wmissing-field-initializers" "-Wmissing-include-dirs" "-Wnested-externs" "-Wredundant-decls" "-Wshadow" "-Wsign-compare" "-Wsign-conversion" "-Wstrict-prototypes" "-Wundef" "-Wuninitialized" "-gfull" "-DNDEBUG" "-o" "/opt/rustwide/target/aarch64-apple-darwin/debug/build/ring/5ff4bd8b385b48b7/out/aaa1ba3e455ee2e1-limbs.o" "-c" "/opt/rustwide/cargo-home/registry/src/index.crates.io-1949cf8c6b5b557f/ring-0.17.14/crypto/limbs/limbs.c"cargo:warning=cc: error: unrecognized command-line option '-arch' [INFO] [stderr] cargo:warning=cc: error: unrecognized command-line option '-mmacosx-version-min=11.0' [INFO] [stderr] [INFO] [stderr] exit status: 1 [INFO] [stderr] cargo:warning=ToolExecError: command did not execute successfully (status code exit status: 1): LC_ALL="C" "cc" "-O0" "-ffunction-sections" "-fdata-sections" "-fPIC" "-g" "-gdwarf-2" "-fno-omit-frame-pointer" "-arch" "arm64" "-mmacosx-version-min=11.0" "-I" "/opt/rustwide/cargo-home/registry/src/index.crates.io-1949cf8c6b5b557f/ring-0.17.14/include" "-I" "/opt/rustwide/cargo-home/registry/src/index.crates.io-1949cf8c6b5b557f/ring-0.17.14/pregenerated" "-Wall" "-Wextra" "-fvisibility=hidden" "-std=c1x" "-Wall" "-Wbad-function-cast" "-Wcast-align" "-Wcast-qual" "-Wconversion" "-Wmissing-field-initializers" "-Wmissing-include-dirs" "-Wnested-externs" "-Wredundant-decls" "-Wshadow" "-Wsign-compare" "-Wsign-conversion" "-Wstrict-prototypes" "-Wundef" "-Wuninitialized" "-gfull" "-DNDEBUG" "-o" "/opt/rustwide/target/aarch64-apple-darwin/debug/build/ring/5ff4bd8b385b48b7/out/a4019cc0736b0423-mem.o" "-c" "/opt/rustwide/cargo-home/registry/src/index.crates.io-1949cf8c6b5b557f/ring-0.17.14/crypto/mem.c"cargo:warning=cc: error: unrecognized debug output level 'full' [INFO] [stderr] cargo:warning=cc: error: unrecognized command-line option '-arch' [INFO] [stderr] cargo:warning=cc: error: unrecognized command-line option '-mmacosx-version-min=11.0' [INFO] [stderr] [INFO] [stderr] exit status: 1 [INFO] [stderr] cargo:warning=ToolExecError: command did not execute successfully (status code exit status: 1): LC_ALL="C" "cc" "-O0" "-ffunction-sections" "-fdata-sections" "-fPIC" "-g" "-gdwarf-2" "-fno-omit-frame-pointer" "-arch" "arm64" "-mmacosx-version-min=11.0" "-I" "/opt/rustwide/cargo-home/registry/src/index.crates.io-1949cf8c6b5b557f/ring-0.17.14/include" "-I" "/opt/rustwide/cargo-home/registry/src/index.crates.io-1949cf8c6b5b557f/ring-0.17.14/pregenerated" "-Wall" "-Wextra" "-fvisibility=hidden" "-std=c1x" "-Wall" "-Wbad-function-cast" "-Wcast-align" "-Wcast-qual" "-Wconversion" "-Wmissing-field-initializers" "-Wmissing-include-dirs" "-Wnested-externs" "-Wredundant-decls" "-Wshadow" "-Wsign-compare" "-Wsign-conversion" "-Wstrict-prototypes" "-Wundef" "-Wuninitialized" "-gfull" "-DNDEBUG" "-o" "/opt/rustwide/target/aarch64-apple-darwin/debug/build/ring/5ff4bd8b385b48b7/out/d5a9841f3dc6e253-poly1305.o" "-c" "/opt/rustwide/cargo-home/registry/src/index.crates.io-1949cf8c6b5b557f/ring-0.17.14/crypto/poly1305/poly1305.c"cargo:warning=cc: error: unrecognized debug output level 'full' [INFO] [stderr] cargo:warning=cc: error: unrecognized command-line option '-arch' [INFO] [stderr] cargo:warning=cc: error: unrecognized command-line option '-mmacosx-version-min=11.0' [INFO] [stderr] [INFO] [stderr] exit status: 1 [INFO] [stderr] cargo:warning=ToolExecError: command did not execute successfully (status code exit status: 1): LC_ALL="C" "cc" "-O0" "-ffunction-sections" "-fdata-sections" "-fPIC" "-g" "-gdwarf-2" "-fno-omit-frame-pointer" "-arch" "arm64" "-mmacosx-version-min=11.0" "-I" "/opt/rustwide/cargo-home/registry/src/index.crates.io-1949cf8c6b5b557f/ring-0.17.14/include" "-I" "/opt/rustwide/cargo-home/registry/src/index.crates.io-1949cf8c6b5b557f/ring-0.17.14/pregenerated" "-Wall" "-Wextra" "-fvisibility=hidden" "-std=c1x" "-Wall" "-Wbad-function-cast" "-Wcast-align" "-Wcast-qual" "-Wconversion" "-Wmissing-field-initializers" "-Wmissing-include-dirs" "-Wnested-externs" "-Wredundant-decls" "-Wshadow" "-Wsign-compare" "-Wsign-conversion" "-Wstrict-prototypes" "-Wundef" "-Wuninitialized" "-gfull" "-DNDEBUG" "-o" "/opt/rustwide/target/aarch64-apple-darwin/debug/build/ring/5ff4bd8b385b48b7/out/a0330e891e733f4e-p256-nistz.o" "-c" "/opt/rustwide/cargo-home/registry/src/index.crates.io-1949cf8c6b5b557f/ring-0.17.14/crypto/fipsmodule/ec/p256-nistz.c"cargo:warning=cc: error: unrecognized debug output level 'full' [INFO] [stderr] cargo:warning=cc: error: unrecognized command-line option '-arch' [INFO] [stderr] cargo:warning=cc: error: unrecognized command-line option '-mmacosx-version-min=11.0' [INFO] [stderr] [INFO] [stderr] exit status: 1 [INFO] [stderr] cargo:warning=ToolExecError: command did not execute successfully (status code exit status: 1): LC_ALL="C" "cc" "-O0" "-ffunction-sections" "-fdata-sections" "-fPIC" "-g" "-gdwarf-2" "-fno-omit-frame-pointer" "-arch" "arm64" "-mmacosx-version-min=11.0" "-I" "/opt/rustwide/cargo-home/registry/src/index.crates.io-1949cf8c6b5b557f/ring-0.17.14/include" "-I" "/opt/rustwide/cargo-home/registry/src/index.crates.io-1949cf8c6b5b557f/ring-0.17.14/pregenerated" "-Wall" "-Wextra" "-fvisibility=hidden" "-std=c1x" "-Wall" "-Wbad-function-cast" "-Wcast-align" "-Wcast-qual" "-Wconversion" "-Wmissing-field-initializers" "-Wmissing-include-dirs" "-Wnested-externs" "-Wredundant-decls" "-Wshadow" "-Wsign-compare" "-Wsign-conversion" "-Wstrict-prototypes" "-Wundef" "-Wuninitialized" "-gfull" "-DNDEBUG" "-o" "/opt/rustwide/target/aarch64-apple-darwin/debug/build/ring/5ff4bd8b385b48b7/out/c322a0bcc369f531-chacha-armv8-ios64.o" "-c" "/opt/rustwide/cargo-home/registry/src/index.crates.io-1949cf8c6b5b557f/ring-0.17.14/pregenerated/chacha-armv8-ios64.S"cargo:warning=cc: error: unrecognized debug output level 'full' [INFO] [stderr] cargo:warning=cc: error: unrecognized debug output level 'full' [INFO] [stderr] cargo:warning=cc: error: unrecognized debug output level 'full' [INFO] [stderr] cargo:warning=cc: error: unrecognized command-line option '-arch' [INFO] [stderr] cargo:warning=cc: error: unrecognized command-line option '-mmacosx-version-min=11.0' [INFO] [stderr] [INFO] [stderr] exit status: 1 [INFO] [stderr] cargo:warning=ToolExecError: command did not execute successfully (status code exit status: 1): LC_ALL="C" "cc" "-O0" "-ffunction-sections" "-fdata-sections" "-fPIC" "-g" "-gdwarf-2" "-fno-omit-frame-pointer" "-arch" "arm64" "-mmacosx-version-min=11.0" "-I" "/opt/rustwide/cargo-home/registry/src/index.crates.io-1949cf8c6b5b557f/ring-0.17.14/include" "-I" "/opt/rustwide/cargo-home/registry/src/index.crates.io-1949cf8c6b5b557f/ring-0.17.14/pregenerated" "-Wall" "-Wextra" "-fvisibility=hidden" "-std=c1x" "-Wall" "-Wbad-function-cast" "-Wcast-align" "-Wcast-qual" "-Wconversion" "-Wmissing-field-initializers" "-Wmissing-include-dirs" "-Wnested-externs" "-Wredundant-decls" "-Wshadow" "-Wsign-compare" "-Wsign-conversion" "-Wstrict-prototypes" "-Wundef" "-Wuninitialized" "-gfull" "-DNDEBUG" "-o" "/opt/rustwide/target/aarch64-apple-darwin/debug/build/ring/5ff4bd8b385b48b7/out/c322a0bcc369f531-chacha20_poly1305_armv8-ios64.o" "-c" "/opt/rustwide/cargo-home/registry/src/index.crates.io-1949cf8c6b5b557f/ring-0.17.14/pregenerated/chacha20_poly1305_armv8-ios64.S"cargo:warning=cc: error: unrecognized command-line option '-arch' [INFO] [stderr] cargo:warning=cc: error: unrecognized command-line option '-mmacosx-version-min=11.0' [INFO] [stderr] [INFO] [stderr] exit status: 1 [INFO] [stderr] cargo:warning=ToolExecError: command did not execute successfully (status code exit status: 1): LC_ALL="C" "cc" "-O0" "-ffunction-sections" "-fdata-sections" "-fPIC" "-g" "-gdwarf-2" "-fno-omit-frame-pointer" "-arch" "arm64" "-mmacosx-version-min=11.0" "-I" "/opt/rustwide/cargo-home/registry/src/index.crates.io-1949cf8c6b5b557f/ring-0.17.14/include" "-I" "/opt/rustwide/cargo-home/registry/src/index.crates.io-1949cf8c6b5b557f/ring-0.17.14/pregenerated" "-Wall" "-Wextra" "-fvisibility=hidden" "-std=c1x" "-Wall" "-Wbad-function-cast" "-Wcast-align" "-Wcast-qual" "-Wconversion" "-Wmissing-field-initializers" "-Wmissing-include-dirs" "-Wnested-externs" "-Wredundant-decls" "-Wshadow" "-Wsign-compare" "-Wsign-conversion" "-Wstrict-prototypes" "-Wundef" "-Wuninitialized" "-gfull" "-DNDEBUG" "-o" "/opt/rustwide/target/aarch64-apple-darwin/debug/build/ring/5ff4bd8b385b48b7/out/c322a0bcc369f531-aesv8-armx-ios64.o" "-c" "/opt/rustwide/cargo-home/registry/src/index.crates.io-1949cf8c6b5b557f/ring-0.17.14/pregenerated/aesv8-armx-ios64.S"cargo:warning=cc: error: unrecognized command-line option '-arch' [INFO] [stderr] cargo:warning=cc: error: unrecognized command-line option '-mmacosx-version-min=11.0' [INFO] [stderr] [INFO] [stderr] exit status: 1 [INFO] [stderr] cargo:warning=ToolExecError: command did not execute successfully (status code exit status: 1): LC_ALL="C" "cc" "-O0" "-ffunction-sections" "-fdata-sections" "-fPIC" "-g" "-gdwarf-2" "-fno-omit-frame-pointer" "-arch" "arm64" "-mmacosx-version-min=11.0" "-I" "/opt/rustwide/cargo-home/registry/src/index.crates.io-1949cf8c6b5b557f/ring-0.17.14/include" "-I" "/opt/rustwide/cargo-home/registry/src/index.crates.io-1949cf8c6b5b557f/ring-0.17.14/pregenerated" "-Wall" "-Wextra" "-fvisibility=hidden" "-std=c1x" "-Wall" "-Wbad-function-cast" "-Wcast-align" "-Wcast-qual" "-Wconversion" "-Wmissing-field-initializers" "-Wmissing-include-dirs" "-Wnested-externs" "-Wredundant-decls" "-Wshadow" "-Wsign-compare" "-Wsign-conversion" "-Wstrict-prototypes" "-Wundef" "-Wuninitialized" "-gfull" "-DNDEBUG" "-o" "/opt/rustwide/target/aarch64-apple-darwin/debug/build/ring/5ff4bd8b385b48b7/out/c322a0bcc369f531-aesv8-gcm-armv8-ios64.o" "-c" "/opt/rustwide/cargo-home/registry/src/index.crates.io-1949cf8c6b5b557f/ring-0.17.14/pregenerated/aesv8-gcm-armv8-ios64.S"cargo:warning=cc: error: unrecognized debug output level 'full' [INFO] [stderr] cargo:warning=cc: error: unrecognized command-line option '-arch' [INFO] [stderr] cargo:warning=cc: error: unrecognized command-line option '-mmacosx-version-min=11.0' [INFO] [stderr] [INFO] [stderr] exit status: 1 [INFO] [stderr] cargo:warning=ToolExecError: command did not execute successfully (status code exit status: 1): LC_ALL="C" "cc" "-O0" "-ffunction-sections" "-fdata-sections" "-fPIC" "-g" "-gdwarf-2" "-fno-omit-frame-pointer" "-arch" "arm64" "-mmacosx-version-min=11.0" "-I" "/opt/rustwide/cargo-home/registry/src/index.crates.io-1949cf8c6b5b557f/ring-0.17.14/include" "-I" "/opt/rustwide/cargo-home/registry/src/index.crates.io-1949cf8c6b5b557f/ring-0.17.14/pregenerated" "-Wall" "-Wextra" "-fvisibility=hidden" "-std=c1x" "-Wall" "-Wbad-function-cast" "-Wcast-align" "-Wcast-qual" "-Wconversion" "-Wmissing-field-initializers" "-Wmissing-include-dirs" "-Wnested-externs" "-Wredundant-decls" "-Wshadow" "-Wsign-compare" "-Wsign-conversion" "-Wstrict-prototypes" "-Wundef" "-Wuninitialized" "-gfull" "-DNDEBUG" "-o" "/opt/rustwide/target/aarch64-apple-darwin/debug/build/ring/5ff4bd8b385b48b7/out/c322a0bcc369f531-ghash-neon-armv8-ios64.o" "-c" "/opt/rustwide/cargo-home/registry/src/index.crates.io-1949cf8c6b5b557f/ring-0.17.14/pregenerated/ghash-neon-armv8-ios64.S"cargo:warning=cc: error: unrecognized debug output level 'full' [INFO] [stderr] cargo:warning=cc: error: unrecognized command-line option '-arch' [INFO] [stderr] cargo:warning=cc: error: unrecognized command-line option '-mmacosx-version-min=11.0' [INFO] [stderr] [INFO] [stderr] exit status: 1 [INFO] [stderr] cargo:warning=ToolExecError: command did not execute successfully (status code exit status: 1): LC_ALL="C" "cc" "-O0" "-ffunction-sections" "-fdata-sections" "-fPIC" "-g" "-gdwarf-2" "-fno-omit-frame-pointer" "-arch" "arm64" "-mmacosx-version-min=11.0" "-I" "/opt/rustwide/cargo-home/registry/src/index.crates.io-1949cf8c6b5b557f/ring-0.17.14/include" "-I" "/opt/rustwide/cargo-home/registry/src/index.crates.io-1949cf8c6b5b557f/ring-0.17.14/pregenerated" "-Wall" "-Wextra" "-fvisibility=hidden" "-std=c1x" "-Wall" "-Wbad-function-cast" "-Wcast-align" "-Wcast-qual" "-Wconversion" "-Wmissing-field-initializers" "-Wmissing-include-dirs" "-Wnested-externs" "-Wredundant-decls" "-Wshadow" "-Wsign-compare" "-Wsign-conversion" "-Wstrict-prototypes" "-Wundef" "-Wuninitialized" "-gfull" "-DNDEBUG" "-o" "/opt/rustwide/target/aarch64-apple-darwin/debug/build/ring/5ff4bd8b385b48b7/out/c322a0bcc369f531-ghashv8-armx-ios64.o" "-c" "/opt/rustwide/cargo-home/registry/src/index.crates.io-1949cf8c6b5b557f/ring-0.17.14/pregenerated/ghashv8-armx-ios64.S"cargo:warning=cc: error: unrecognized debug output level 'full' [INFO] [stderr] cargo:warning=cc: error: unrecognized command-line option '-arch' [INFO] [stderr] cargo:warning=cc: error: unrecognized command-line option '-mmacosx-version-min=11.0' [INFO] [stderr] [INFO] [stderr] exit status: 1 [INFO] [stderr] cargo:warning=ToolExecError: command did not execute successfully (status code exit status: 1): LC_ALL="C" "cc" "-O0" "-ffunction-sections" "-fdata-sections" "-fPIC" "-g" "-gdwarf-2" "-fno-omit-frame-pointer" "-arch" "arm64" "-mmacosx-version-min=11.0" "-I" "/opt/rustwide/cargo-home/registry/src/index.crates.io-1949cf8c6b5b557f/ring-0.17.14/include" "-I" "/opt/rustwide/cargo-home/registry/src/index.crates.io-1949cf8c6b5b557f/ring-0.17.14/pregenerated" "-Wall" "-Wextra" "-fvisibility=hidden" "-std=c1x" "-Wall" "-Wbad-function-cast" "-Wcast-align" "-Wcast-qual" "-Wconversion" "-Wmissing-field-initializers" "-Wmissing-include-dirs" "-Wnested-externs" "-Wredundant-decls" "-Wshadow" "-Wsign-compare" "-Wsign-conversion" "-Wstrict-prototypes" "-Wundef" "-Wuninitialized" "-gfull" "-DNDEBUG" "-o" "/opt/rustwide/target/aarch64-apple-darwin/debug/build/ring/5ff4bd8b385b48b7/out/c322a0bcc369f531-vpaes-armv8-ios64.o" "-c" "/opt/rustwide/cargo-home/registry/src/index.crates.io-1949cf8c6b5b557f/ring-0.17.14/pregenerated/vpaes-armv8-ios64.S"cargo:warning=cc: error: unrecognized debug output level 'full' [INFO] [stderr] cargo:warning=cc: error: unrecognized command-line option '-arch' [INFO] [stderr] cargo:warning=cc: error: unrecognized command-line option '-mmacosx-version-min=11.0' [INFO] [stderr] [INFO] [stderr] exit status: 1 [INFO] [stderr] cargo:warning=ToolExecError: command did not execute successfully (status code exit status: 1): LC_ALL="C" "cc" "-O0" "-ffunction-sections" "-fdata-sections" "-fPIC" "-g" "-gdwarf-2" "-fno-omit-frame-pointer" "-arch" "arm64" "-mmacosx-version-min=11.0" "-I" "/opt/rustwide/cargo-home/registry/src/index.crates.io-1949cf8c6b5b557f/ring-0.17.14/include" "-I" "/opt/rustwide/cargo-home/registry/src/index.crates.io-1949cf8c6b5b557f/ring-0.17.14/pregenerated" "-Wall" "-Wextra" "-fvisibility=hidden" "-std=c1x" "-Wall" "-Wbad-function-cast" "-Wcast-align" "-Wcast-qual" "-Wconversion" "-Wmissing-field-initializers" "-Wmissing-include-dirs" "-Wnested-externs" "-Wredundant-decls" "-Wshadow" "-Wsign-compare" "-Wsign-conversion" "-Wstrict-prototypes" "-Wundef" "-Wuninitialized" "-gfull" "-DNDEBUG" "-o" "/opt/rustwide/target/aarch64-apple-darwin/debug/build/ring/5ff4bd8b385b48b7/out/c322a0bcc369f531-armv8-mont-ios64.o" "-c" "/opt/rustwide/cargo-home/registry/src/index.crates.io-1949cf8c6b5b557f/ring-0.17.14/pregenerated/armv8-mont-ios64.S"cargo:warning=cc: error: unrecognized debug output level 'full' [INFO] [stderr] cargo:warning=cc: error: unrecognized command-line option '-arch' [INFO] [stderr] cargo:warning=cc: error: unrecognized command-line option '-mmacosx-version-min=11.0' [INFO] [stderr] [INFO] [stderr] exit status: 1 [INFO] [stderr] cargo:warning=ToolExecError: command did not execute successfully (status code exit status: 1): LC_ALL="C" "cc" "-O0" "-ffunction-sections" "-fdata-sections" "-fPIC" "-g" "-gdwarf-2" "-fno-omit-frame-pointer" "-arch" "arm64" "-mmacosx-version-min=11.0" "-I" "/opt/rustwide/cargo-home/registry/src/index.crates.io-1949cf8c6b5b557f/ring-0.17.14/include" "-I" "/opt/rustwide/cargo-home/registry/src/index.crates.io-1949cf8c6b5b557f/ring-0.17.14/pregenerated" "-Wall" "-Wextra" "-fvisibility=hidden" "-std=c1x" "-Wall" "-Wbad-function-cast" "-Wcast-align" "-Wcast-qual" "-Wconversion" "-Wmissing-field-initializers" "-Wmissing-include-dirs" "-Wnested-externs" "-Wredundant-decls" "-Wshadow" "-Wsign-compare" "-Wsign-conversion" "-Wstrict-prototypes" "-Wundef" "-Wuninitialized" "-gfull" "-DNDEBUG" "-o" "/opt/rustwide/target/aarch64-apple-darwin/debug/build/ring/5ff4bd8b385b48b7/out/c322a0bcc369f531-p256-armv8-asm-ios64.o" "-c" "/opt/rustwide/cargo-home/registry/src/index.crates.io-1949cf8c6b5b557f/ring-0.17.14/pregenerated/p256-armv8-asm-ios64.S"cargo:warning=cc: error: unrecognized debug output level 'full' [INFO] [stderr] cargo:warning=cc: error: unrecognized command-line option '-arch' [INFO] [stderr] cargo:warning=cc: error: unrecognized command-line option '-mmacosx-version-min=11.0' [INFO] [stderr] [INFO] [stderr] exit status: 1 [INFO] [stderr] cargo:warning=ToolExecError: command did not execute successfully (status code exit status: 1): LC_ALL="C" "cc" "-O0" "-ffunction-sections" "-fdata-sections" "-fPIC" "-g" "-gdwarf-2" "-fno-omit-frame-pointer" "-arch" "arm64" "-mmacosx-version-min=11.0" "-I" "/opt/rustwide/cargo-home/registry/src/index.crates.io-1949cf8c6b5b557f/ring-0.17.14/include" "-I" "/opt/rustwide/cargo-home/registry/src/index.crates.io-1949cf8c6b5b557f/ring-0.17.14/pregenerated" "-Wall" "-Wextra" "-fvisibility=hidden" "-std=c1x" "-Wall" "-Wbad-function-cast" "-Wcast-align" "-Wcast-qual" "-Wconversion" "-Wmissing-field-initializers" "-Wmissing-include-dirs" "-Wnested-externs" "-Wredundant-decls" "-Wshadow" "-Wsign-compare" "-Wsign-conversion" "-Wstrict-prototypes" "-Wundef" "-Wuninitialized" "-gfull" "-DNDEBUG" "-o" "/opt/rustwide/target/aarch64-apple-darwin/debug/build/ring/5ff4bd8b385b48b7/out/c322a0bcc369f531-sha512-armv8-ios64.o" "-c" "/opt/rustwide/cargo-home/registry/src/index.crates.io-1949cf8c6b5b557f/ring-0.17.14/pregenerated/sha512-armv8-ios64.S"cargo:warning=cc: error: unrecognized debug output level 'full' [INFO] [stderr] cargo:warning=cc: error: unrecognized command-line option '-arch' [INFO] [stderr] cargo:warning=cc: error: unrecognized command-line option '-mmacosx-version-min=11.0' [INFO] [stderr] [INFO] [stderr] exit status: 1 [INFO] [stderr] cargo:warning=ToolExecError: command did not execute successfully (status code exit status: 1): LC_ALL="C" "cc" "-O0" "-ffunction-sections" "-fdata-sections" "-fPIC" "-g" "-gdwarf-2" "-fno-omit-frame-pointer" "-arch" "arm64" "-mmacosx-version-min=11.0" "-I" "/opt/rustwide/cargo-home/registry/src/index.crates.io-1949cf8c6b5b557f/ring-0.17.14/include" "-I" "/opt/rustwide/cargo-home/registry/src/index.crates.io-1949cf8c6b5b557f/ring-0.17.14/pregenerated" "-Wall" "-Wextra" "-fvisibility=hidden" "-std=c1x" "-Wall" "-Wbad-function-cast" "-Wcast-align" "-Wcast-qual" "-Wconversion" "-Wmissing-field-initializers" "-Wmissing-include-dirs" "-Wnested-externs" "-Wredundant-decls" "-Wshadow" "-Wsign-compare" "-Wsign-conversion" "-Wstrict-prototypes" "-Wundef" "-Wuninitialized" "-gfull" "-DNDEBUG" "-o" "/opt/rustwide/target/aarch64-apple-darwin/debug/build/ring/5ff4bd8b385b48b7/out/c322a0bcc369f531-sha256-armv8-ios64.o" "-c" "/opt/rustwide/cargo-home/registry/src/index.crates.io-1949cf8c6b5b557f/ring-0.17.14/pregenerated/sha256-armv8-ios64.S" [INFO] [stderr] [INFO] [stderr] --- stderr [INFO] [stderr] [INFO] [stderr] [INFO] [stderr] error occurred in cc-rs: command did not execute successfully (status code exit status: 1): LC_ALL="C" "cc" "-O0" "-ffunction-sections" "-fdata-sections" "-fPIC" "-g" "-gdwarf-2" "-fno-omit-frame-pointer" "-arch" "arm64" "-mmacosx-version-min=11.0" "-I" "/opt/rustwide/cargo-home/registry/src/index.crates.io-1949cf8c6b5b557f/ring-0.17.14/include" "-I" "/opt/rustwide/cargo-home/registry/src/index.crates.io-1949cf8c6b5b557f/ring-0.17.14/pregenerated" "-Wall" "-Wextra" "-fvisibility=hidden" "-std=c1x" "-Wall" "-Wbad-function-cast" "-Wcast-align" "-Wcast-qual" "-Wconversion" "-Wmissing-field-initializers" "-Wmissing-include-dirs" "-Wnested-externs" "-Wredundant-decls" "-Wshadow" "-Wsign-compare" "-Wsign-conversion" "-Wstrict-prototypes" "-Wundef" "-Wuninitialized" "-gfull" "-DNDEBUG" "-o" "/opt/rustwide/target/aarch64-apple-darwin/debug/build/ring/5ff4bd8b385b48b7/out/c322a0bcc369f531-sha256-armv8-ios64.o" "-c" "/opt/rustwide/cargo-home/registry/src/index.crates.io-1949cf8c6b5b557f/ring-0.17.14/pregenerated/sha256-armv8-ios64.S" [INFO] [stderr] [INFO] [stderr] [INFO] [stderr] warning: zstd-sys@2.1.0+zstd.1.5.7: cc: error: unrecognized command-line option '-arch' [INFO] [stderr] warning: zstd-sys@2.1.0+zstd.1.5.7: cc: error: unrecognized command-line option '-mmacosx-version-min=11.0' [INFO] [stderr] warning: zstd-sys@2.1.0+zstd.1.5.7: ToolExecError: command did not execute successfully (status code exit status: 1): LC_ALL="C" "cc" "-O0" "-ffunction-sections" "-fdata-sections" "-fPIC" "-g" "-gdwarf-2" "-fno-omit-frame-pointer" "-arch" "arm64" "-mmacosx-version-min=11.0" "-I" "zstd/lib/" "-I" "zstd/lib/common" "-w" "-fvisibility=hidden" "-DZSTD_DISABLE_ASM=" "-DZSTD_LIB_DEPRECATED=0" "-DXXH_PRIVATE_API=" "-DZSTDLIB_VISIBILITY=" "-DZSTDERRORLIB_VISIBILITY=" "-o" "/opt/rustwide/target/aarch64-apple-darwin/debug/build/zstd-sys/eeb3960467ef0fef/out/44ff4c55aa9e5133-debug.o" "-c" "zstd/lib/common/debug.c"cargo:warning=cc: error: unrecognized command-line option '-arch' [INFO] [stderr] warning: zstd-sys@2.1.0+zstd.1.5.7: cc: error: unrecognized command-line option '-mmacosx-version-min=11.0' [INFO] [stderr] warning: zstd-sys@2.1.0+zstd.1.5.7: ToolExecError: command did not execute successfully (status code exit status: 1): LC_ALL="C" "cc" "-O0" "-ffunction-sections" "-fdata-sections" "-fPIC" "-g" "-gdwarf-2" "-fno-omit-frame-pointer" "-arch" "arm64" "-mmacosx-version-min=11.0" "-I" "zstd/lib/" "-I" "zstd/lib/common" "-w" "-fvisibility=hidden" "-DZSTD_DISABLE_ASM=" "-DZSTD_LIB_DEPRECATED=0" "-DXXH_PRIVATE_API=" "-DZSTDLIB_VISIBILITY=" "-DZSTDERRORLIB_VISIBILITY=" "-o" "/opt/rustwide/target/aarch64-apple-darwin/debug/build/zstd-sys/eeb3960467ef0fef/out/44ff4c55aa9e5133-entropy_common.o" "-c" "zstd/lib/common/entropy_common.c"cargo:rerun-if-env-changed=CC_aarch64-apple-darwin [INFO] [stderr] warning: zstd-sys@2.1.0+zstd.1.5.7: cc: error: unrecognized command-line option '-arch' [INFO] [stderr] warning: zstd-sys@2.1.0+zstd.1.5.7: cc: error: unrecognized command-line option '-mmacosx-version-min=11.0' [INFO] [stderr] warning: zstd-sys@2.1.0+zstd.1.5.7: ToolExecError: command did not execute successfully (status code exit status: 1): LC_ALL="C" "cc" "-O0" "-ffunction-sections" "-fdata-sections" "-fPIC" "-g" "-gdwarf-2" "-fno-omit-frame-pointer" "-arch" "arm64" "-mmacosx-version-min=11.0" "-I" "zstd/lib/" "-I" "zstd/lib/common" "-w" "-fvisibility=hidden" "-DZSTD_DISABLE_ASM=" "-DZSTD_LIB_DEPRECATED=0" "-DXXH_PRIVATE_API=" "-DZSTDLIB_VISIBILITY=" "-DZSTDERRORLIB_VISIBILITY=" "-o" "/opt/rustwide/target/aarch64-apple-darwin/debug/build/zstd-sys/eeb3960467ef0fef/out/44ff4c55aa9e5133-error_private.o" "-c" "zstd/lib/common/error_private.c"cargo:warning=cc: error: unrecognized command-line option '-arch' [INFO] [stderr] warning: zstd-sys@2.1.0+zstd.1.5.7: cc: error: unrecognized command-line option '-mmacosx-version-min=11.0' [INFO] [stderr] warning: zstd-sys@2.1.0+zstd.1.5.7: ToolExecError: command did not execute successfully (status code exit status: 1): LC_ALL="C" "cc" "-O0" "-ffunction-sections" "-fdata-sections" "-fPIC" "-g" "-gdwarf-2" "-fno-omit-frame-pointer" "-arch" "arm64" "-mmacosx-version-min=11.0" "-I" "zstd/lib/" "-I" "zstd/lib/common" "-w" "-fvisibility=hidden" "-DZSTD_DISABLE_ASM=" "-DZSTD_LIB_DEPRECATED=0" "-DXXH_PRIVATE_API=" "-DZSTDLIB_VISIBILITY=" "-DZSTDERRORLIB_VISIBILITY=" "-o" "/opt/rustwide/target/aarch64-apple-darwin/debug/build/zstd-sys/eeb3960467ef0fef/out/44ff4c55aa9e5133-fse_decompress.o" "-c" "zstd/lib/common/fse_decompress.c"cargo:rerun-if-env-changed=CC_aarch64-apple-darwin [INFO] [stderr] warning: zstd-sys@2.1.0+zstd.1.5.7: cc: error: unrecognized command-line option '-arch' [INFO] [stderr] warning: zstd-sys@2.1.0+zstd.1.5.7: cc: error: unrecognized command-line option '-mmacosx-version-min=11.0' [INFO] [stderr] warning: zstd-sys@2.1.0+zstd.1.5.7: ToolExecError: command did not execute successfully (status code exit status: 1): LC_ALL="C" "cc" "-O0" "-ffunction-sections" "-fdata-sections" "-fPIC" "-g" "-gdwarf-2" "-fno-omit-frame-pointer" "-arch" "arm64" "-mmacosx-version-min=11.0" "-I" "zstd/lib/" "-I" "zstd/lib/common" "-w" "-fvisibility=hidden" "-DZSTD_DISABLE_ASM=" "-DZSTD_LIB_DEPRECATED=0" "-DXXH_PRIVATE_API=" "-DZSTDLIB_VISIBILITY=" "-DZSTDERRORLIB_VISIBILITY=" "-o" "/opt/rustwide/target/aarch64-apple-darwin/debug/build/zstd-sys/eeb3960467ef0fef/out/44ff4c55aa9e5133-pool.o" "-c" "zstd/lib/common/pool.c"cargo:warning=cc: error: unrecognized command-line option '-arch' [INFO] [stderr] warning: zstd-sys@2.1.0+zstd.1.5.7: cc: error: unrecognized command-line option '-mmacosx-version-min=11.0' [INFO] [stderr] warning: zstd-sys@2.1.0+zstd.1.5.7: ToolExecError: command did not execute successfully (status code exit status: 1): LC_ALL="C" "cc" "-O0" "-ffunction-sections" "-fdata-sections" "-fPIC" "-g" "-gdwarf-2" "-fno-omit-frame-pointer" "-arch" "arm64" "-mmacosx-version-min=11.0" "-I" "zstd/lib/" "-I" "zstd/lib/common" "-w" "-fvisibility=hidden" "-DZSTD_DISABLE_ASM=" "-DZSTD_LIB_DEPRECATED=0" "-DXXH_PRIVATE_API=" "-DZSTDLIB_VISIBILITY=" "-DZSTDERRORLIB_VISIBILITY=" "-o" "/opt/rustwide/target/aarch64-apple-darwin/debug/build/zstd-sys/eeb3960467ef0fef/out/44ff4c55aa9e5133-threading.o" "-c" "zstd/lib/common/threading.c"cargo:rerun-if-env-changed=CC_aarch64-apple-darwin [INFO] [stderr] warning: zstd-sys@2.1.0+zstd.1.5.7: cc: error: unrecognized command-line option '-arch' [INFO] [stderr] warning: zstd-sys@2.1.0+zstd.1.5.7: cc: error: unrecognized command-line option '-mmacosx-version-min=11.0' [INFO] [stderr] warning: zstd-sys@2.1.0+zstd.1.5.7: ToolExecError: command did not execute successfully (status code exit status: 1): LC_ALL="C" "cc" "-O0" "-ffunction-sections" "-fdata-sections" "-fPIC" "-g" "-gdwarf-2" "-fno-omit-frame-pointer" "-arch" "arm64" "-mmacosx-version-min=11.0" "-I" "zstd/lib/" "-I" "zstd/lib/common" "-w" "-fvisibility=hidden" "-DZSTD_DISABLE_ASM=" "-DZSTD_LIB_DEPRECATED=0" "-DXXH_PRIVATE_API=" "-DZSTDLIB_VISIBILITY=" "-DZSTDERRORLIB_VISIBILITY=" "-o" "/opt/rustwide/target/aarch64-apple-darwin/debug/build/zstd-sys/eeb3960467ef0fef/out/44ff4c55aa9e5133-zstd_common.o" "-c" "zstd/lib/common/zstd_common.c"cargo:rerun-if-env-changed=CC_aarch64-apple-darwin [INFO] [stderr] warning: zstd-sys@2.1.0+zstd.1.5.7: cc: error: unrecognized command-line option '-arch' [INFO] [stderr] warning: zstd-sys@2.1.0+zstd.1.5.7: cc: error: unrecognized command-line option '-mmacosx-version-min=11.0' [INFO] [stderr] warning: zstd-sys@2.1.0+zstd.1.5.7: ToolExecError: command did not execute successfully (status code exit status: 1): LC_ALL="C" "cc" "-O0" "-ffunction-sections" "-fdata-sections" "-fPIC" "-g" "-gdwarf-2" "-fno-omit-frame-pointer" "-arch" "arm64" "-mmacosx-version-min=11.0" "-I" "zstd/lib/" "-I" "zstd/lib/common" "-w" "-fvisibility=hidden" "-DZSTD_DISABLE_ASM=" "-DZSTD_LIB_DEPRECATED=0" "-DXXH_PRIVATE_API=" "-DZSTDLIB_VISIBILITY=" "-DZSTDERRORLIB_VISIBILITY=" "-o" "/opt/rustwide/target/aarch64-apple-darwin/debug/build/zstd-sys/eeb3960467ef0fef/out/fb80479a5fb81f6a-fse_compress.o" "-c" "zstd/lib/compress/fse_compress.c"cargo:rerun-if-env-changed=CC_aarch64-apple-darwin [INFO] [stderr] warning: zstd-sys@2.1.0+zstd.1.5.7: cc: error: unrecognized command-line option '-arch' [INFO] [stderr] warning: zstd-sys@2.1.0+zstd.1.5.7: cc: error: unrecognized command-line option '-mmacosx-version-min=11.0' [INFO] [stderr] warning: zstd-sys@2.1.0+zstd.1.5.7: ToolExecError: command did not execute successfully (status code exit status: 1): LC_ALL="C" "cc" "-O0" "-ffunction-sections" "-fdata-sections" "-fPIC" "-g" "-gdwarf-2" "-fno-omit-frame-pointer" "-arch" "arm64" "-mmacosx-version-min=11.0" "-I" "zstd/lib/" "-I" "zstd/lib/common" "-w" "-fvisibility=hidden" "-DZSTD_DISABLE_ASM=" "-DZSTD_LIB_DEPRECATED=0" "-DXXH_PRIVATE_API=" "-DZSTDLIB_VISIBILITY=" "-DZSTDERRORLIB_VISIBILITY=" "-o" "/opt/rustwide/target/aarch64-apple-darwin/debug/build/zstd-sys/eeb3960467ef0fef/out/fb80479a5fb81f6a-hist.o" "-c" "zstd/lib/compress/hist.c"cargo:rerun-if-env-changed=CC_aarch64-apple-darwin [INFO] [stderr] warning: zstd-sys@2.1.0+zstd.1.5.7: cc: error: unrecognized command-line option '-arch' [INFO] [stderr] warning: zstd-sys@2.1.0+zstd.1.5.7: cc: error: unrecognized command-line option '-mmacosx-version-min=11.0' [INFO] [stderr] warning: zstd-sys@2.1.0+zstd.1.5.7: ToolExecError: command did not execute successfully (status code exit status: 1): LC_ALL="C" "cc" "-O0" "-ffunction-sections" "-fdata-sections" "-fPIC" "-g" "-gdwarf-2" "-fno-omit-frame-pointer" "-arch" "arm64" "-mmacosx-version-min=11.0" "-I" "zstd/lib/" "-I" "zstd/lib/common" "-w" "-fvisibility=hidden" "-DZSTD_DISABLE_ASM=" "-DZSTD_LIB_DEPRECATED=0" "-DXXH_PRIVATE_API=" "-DZSTDLIB_VISIBILITY=" "-DZSTDERRORLIB_VISIBILITY=" "-o" "/opt/rustwide/target/aarch64-apple-darwin/debug/build/zstd-sys/eeb3960467ef0fef/out/fb80479a5fb81f6a-huf_compress.o" "-c" "zstd/lib/compress/huf_compress.c"cargo:warning=cc: error: unrecognized command-line option '-arch' [INFO] [stderr] warning: zstd-sys@2.1.0+zstd.1.5.7: cc: error: unrecognized command-line option '-mmacosx-version-min=11.0' [INFO] [stderr] warning: zstd-sys@2.1.0+zstd.1.5.7: ToolExecError: command did not execute successfully (status code exit status: 1): LC_ALL="C" "cc" "-O0" "-ffunction-sections" "-fdata-sections" "-fPIC" "-g" "-gdwarf-2" "-fno-omit-frame-pointer" "-arch" "arm64" "-mmacosx-version-min=11.0" "-I" "zstd/lib/" "-I" "zstd/lib/common" "-w" "-fvisibility=hidden" "-DZSTD_DISABLE_ASM=" "-DZSTD_LIB_DEPRECATED=0" "-DXXH_PRIVATE_API=" "-DZSTDLIB_VISIBILITY=" "-DZSTDERRORLIB_VISIBILITY=" "-o" "/opt/rustwide/target/aarch64-apple-darwin/debug/build/zstd-sys/eeb3960467ef0fef/out/fb80479a5fb81f6a-zstd_compress.o" "-c" "zstd/lib/compress/zstd_compress.c"cargo:rerun-if-env-changed=CC_aarch64-apple-darwin [INFO] [stderr] warning: zstd-sys@2.1.0+zstd.1.5.7: cc: error: unrecognized command-line option '-arch' [INFO] [stderr] warning: zstd-sys@2.1.0+zstd.1.5.7: cc: error: unrecognized command-line option '-arch' [INFO] [stderr] warning: zstd-sys@2.1.0+zstd.1.5.7: cc: error: unrecognized command-line option '-arch' [INFO] [stderr] warning: zstd-sys@2.1.0+zstd.1.5.7: cc: error: unrecognized command-line option '-arch' [INFO] [stderr] warning: zstd-sys@2.1.0+zstd.1.5.7: cc: error: unrecognized command-line option '-arch' [INFO] [stderr] warning: zstd-sys@2.1.0+zstd.1.5.7: cc: error: unrecognized command-line option '-arch' [INFO] [stderr] warning: zstd-sys@2.1.0+zstd.1.5.7: cc: error: unrecognized command-line option '-mmacosx-version-min=11.0' [INFO] [stderr] warning: zstd-sys@2.1.0+zstd.1.5.7: ToolExecError: command did not execute successfully (status code exit status: 1): LC_ALL="C" "cc" "-O0" "-ffunction-sections" "-fdata-sections" "-fPIC" "-g" "-gdwarf-2" "-fno-omit-frame-pointer" "-arch" "arm64" "-mmacosx-version-min=11.0" "-I" "zstd/lib/" "-I" "zstd/lib/common" "-w" "-fvisibility=hidden" "-DZSTD_DISABLE_ASM=" "-DZSTD_LIB_DEPRECATED=0" "-DXXH_PRIVATE_API=" "-DZSTDLIB_VISIBILITY=" "-DZSTDERRORLIB_VISIBILITY=" "-o" "/opt/rustwide/target/aarch64-apple-darwin/debug/build/zstd-sys/eeb3960467ef0fef/out/fb80479a5fb81f6a-zstd_compress_literals.o" "-c" "zstd/lib/compress/zstd_compress_literals.c"cargo:warning=cc: error: unrecognized command-line option '-mmacosx-version-min=11.0' [INFO] [stderr] warning: zstd-sys@2.1.0+zstd.1.5.7: ToolExecError: command did not execute successfully (status code exit status: 1): LC_ALL="C" "cc" "-O0" "-ffunction-sections" "-fdata-sections" "-fPIC" "-g" "-gdwarf-2" "-fno-omit-frame-pointer" "-arch" "arm64" "-mmacosx-version-min=11.0" "-I" "zstd/lib/" "-I" "zstd/lib/common" "-w" "-fvisibility=hidden" "-DZSTD_DISABLE_ASM=" "-DZSTD_LIB_DEPRECATED=0" "-DXXH_PRIVATE_API=" "-DZSTDLIB_VISIBILITY=" "-DZSTDERRORLIB_VISIBILITY=" "-o" "/opt/rustwide/target/aarch64-apple-darwin/debug/build/zstd-sys/eeb3960467ef0fef/out/fb80479a5fb81f6a-zstd_compress_sequences.o" "-c" "zstd/lib/compress/zstd_compress_sequences.c"cargo:warning=cc: error: unrecognized command-line option '-mmacosx-version-min=11.0' [INFO] [stderr] warning: zstd-sys@2.1.0+zstd.1.5.7: ToolExecError: command did not execute successfully (status code exit status: 1): LC_ALL="C" "cc" "-O0" "-ffunction-sections" "-fdata-sections" "-fPIC" "-g" "-gdwarf-2" "-fno-omit-frame-pointer" "-arch" "arm64" "-mmacosx-version-min=11.0" "-I" "zstd/lib/" "-I" "zstd/lib/common" "-w" "-fvisibility=hidden" "-DZSTD_DISABLE_ASM=" "-DZSTD_LIB_DEPRECATED=0" "-DXXH_PRIVATE_API=" "-DZSTDLIB_VISIBILITY=" "-DZSTDERRORLIB_VISIBILITY=" "-o" "/opt/rustwide/target/aarch64-apple-darwin/debug/build/zstd-sys/eeb3960467ef0fef/out/fb80479a5fb81f6a-zstd_compress_superblock.o" "-c" "zstd/lib/compress/zstd_compress_superblock.c"cargo:warning=cc: error: unrecognized command-line option '-mmacosx-version-min=11.0' [INFO] [stderr] warning: zstd-sys@2.1.0+zstd.1.5.7: ToolExecError: command did not execute successfully (status code exit status: 1): LC_ALL="C" "cc" "-O0" "-ffunction-sections" "-fdata-sections" "-fPIC" "-g" "-gdwarf-2" "-fno-omit-frame-pointer" "-arch" "arm64" "-mmacosx-version-min=11.0" "-I" "zstd/lib/" "-I" "zstd/lib/common" "-w" "-fvisibility=hidden" "-DZSTD_DISABLE_ASM=" "-DZSTD_LIB_DEPRECATED=0" "-DXXH_PRIVATE_API=" "-DZSTDLIB_VISIBILITY=" "-DZSTDERRORLIB_VISIBILITY=" "-o" "/opt/rustwide/target/aarch64-apple-darwin/debug/build/zstd-sys/eeb3960467ef0fef/out/fb80479a5fb81f6a-zstd_double_fast.o" "-c" "zstd/lib/compress/zstd_double_fast.c"cargo:warning=cc: error: unrecognized command-line option '-mmacosx-version-min=11.0' [INFO] [stderr] warning: zstd-sys@2.1.0+zstd.1.5.7: ToolExecError: command did not execute successfully (status code exit status: 1): LC_ALL="C" "cc" "-O0" "-ffunction-sections" "-fdata-sections" "-fPIC" "-g" "-gdwarf-2" "-fno-omit-frame-pointer" "-arch" "arm64" "-mmacosx-version-min=11.0" "-I" "zstd/lib/" "-I" "zstd/lib/common" "-w" "-fvisibility=hidden" "-DZSTD_DISABLE_ASM=" "-DZSTD_LIB_DEPRECATED=0" "-DXXH_PRIVATE_API=" "-DZSTDLIB_VISIBILITY=" "-DZSTDERRORLIB_VISIBILITY=" "-o" "/opt/rustwide/target/aarch64-apple-darwin/debug/build/zstd-sys/eeb3960467ef0fef/out/fb80479a5fb81f6a-zstd_fast.o" "-c" "zstd/lib/compress/zstd_fast.c"cargo:warning=cc: error: unrecognized command-line option '-mmacosx-version-min=11.0' [INFO] [stderr] warning: zstd-sys@2.1.0+zstd.1.5.7: ToolExecError: command did not execute successfully (status code exit status: 1): LC_ALL="C" "cc" "-O0" "-ffunction-sections" "-fdata-sections" "-fPIC" "-g" "-gdwarf-2" "-fno-omit-frame-pointer" "-arch" "arm64" "-mmacosx-version-min=11.0" "-I" "zstd/lib/" "-I" "zstd/lib/common" "-w" "-fvisibility=hidden" "-DZSTD_DISABLE_ASM=" "-DZSTD_LIB_DEPRECATED=0" "-DXXH_PRIVATE_API=" "-DZSTDLIB_VISIBILITY=" "-DZSTDERRORLIB_VISIBILITY=" "-o" "/opt/rustwide/target/aarch64-apple-darwin/debug/build/zstd-sys/eeb3960467ef0fef/out/fb80479a5fb81f6a-zstd_lazy.o" "-c" "zstd/lib/compress/zstd_lazy.c"cargo:warning=cc: error: unrecognized command-line option '-arch' [INFO] [stderr] warning: zstd-sys@2.1.0+zstd.1.5.7: cc: error: unrecognized command-line option '-mmacosx-version-min=11.0' [INFO] [stderr] warning: zstd-sys@2.1.0+zstd.1.5.7: ToolExecError: command did not execute successfully (status code exit status: 1): LC_ALL="C" "cc" "-O0" "-ffunction-sections" "-fdata-sections" "-fPIC" "-g" "-gdwarf-2" "-fno-omit-frame-pointer" "-arch" "arm64" "-mmacosx-version-min=11.0" "-I" "zstd/lib/" "-I" "zstd/lib/common" "-w" "-fvisibility=hidden" "-DZSTD_DISABLE_ASM=" "-DZSTD_LIB_DEPRECATED=0" "-DXXH_PRIVATE_API=" "-DZSTDLIB_VISIBILITY=" "-DZSTDERRORLIB_VISIBILITY=" "-o" "/opt/rustwide/target/aarch64-apple-darwin/debug/build/zstd-sys/eeb3960467ef0fef/out/fb80479a5fb81f6a-zstd_ldm.o" "-c" "zstd/lib/compress/zstd_ldm.c"cargo:rerun-if-env-changed=CC_aarch64-apple-darwin [INFO] [stderr] warning: zstd-sys@2.1.0+zstd.1.5.7: cc: error: unrecognized command-line option '-arch' [INFO] [stderr] warning: zstd-sys@2.1.0+zstd.1.5.7: cc: error: unrecognized command-line option '-arch' [INFO] [stderr] warning: zstd-sys@2.1.0+zstd.1.5.7: cc: error: unrecognized command-line option '-arch' [INFO] [stderr] warning: zstd-sys@2.1.0+zstd.1.5.7: cc: error: unrecognized command-line option '-arch' [INFO] [stderr] warning: zstd-sys@2.1.0+zstd.1.5.7: cc: error: unrecognized command-line option '-arch' [INFO] [stderr] warning: zstd-sys@2.1.0+zstd.1.5.7: cc: error: unrecognized command-line option '-arch' [INFO] [stderr] warning: zstd-sys@2.1.0+zstd.1.5.7: cc: error: unrecognized command-line option '-mmacosx-version-min=11.0' [INFO] [stderr] warning: zstd-sys@2.1.0+zstd.1.5.7: ToolExecError: command did not execute successfully (status code exit status: 1): LC_ALL="C" "cc" "-O0" "-ffunction-sections" "-fdata-sections" "-fPIC" "-g" "-gdwarf-2" "-fno-omit-frame-pointer" "-arch" "arm64" "-mmacosx-version-min=11.0" "-I" "zstd/lib/" "-I" "zstd/lib/common" "-w" "-fvisibility=hidden" "-DZSTD_DISABLE_ASM=" "-DZSTD_LIB_DEPRECATED=0" "-DXXH_PRIVATE_API=" "-DZSTDLIB_VISIBILITY=" "-DZSTDERRORLIB_VISIBILITY=" "-o" "/opt/rustwide/target/aarch64-apple-darwin/debug/build/zstd-sys/eeb3960467ef0fef/out/fb80479a5fb81f6a-zstd_opt.o" "-c" "zstd/lib/compress/zstd_opt.c"cargo:warning=cc: error: unrecognized command-line option '-mmacosx-version-min=11.0' [INFO] [stderr] warning: zstd-sys@2.1.0+zstd.1.5.7: ToolExecError: command did not execute successfully (status code exit status: 1): LC_ALL="C" "cc" "-O0" "-ffunction-sections" "-fdata-sections" "-fPIC" "-g" "-gdwarf-2" "-fno-omit-frame-pointer" "-arch" "arm64" "-mmacosx-version-min=11.0" "-I" "zstd/lib/" "-I" "zstd/lib/common" "-w" "-fvisibility=hidden" "-DZSTD_DISABLE_ASM=" "-DZSTD_LIB_DEPRECATED=0" "-DXXH_PRIVATE_API=" "-DZSTDLIB_VISIBILITY=" "-DZSTDERRORLIB_VISIBILITY=" "-o" "/opt/rustwide/target/aarch64-apple-darwin/debug/build/zstd-sys/eeb3960467ef0fef/out/fb80479a5fb81f6a-zstd_preSplit.o" "-c" "zstd/lib/compress/zstd_preSplit.c"cargo:warning=cc: error: unrecognized command-line option '-mmacosx-version-min=11.0' [INFO] [stderr] warning: zstd-sys@2.1.0+zstd.1.5.7: ToolExecError: command did not execute successfully (status code exit status: 1): LC_ALL="C" "cc" "-O0" "-ffunction-sections" "-fdata-sections" "-fPIC" "-g" "-gdwarf-2" "-fno-omit-frame-pointer" "-arch" "arm64" "-mmacosx-version-min=11.0" "-I" "zstd/lib/" "-I" "zstd/lib/common" "-w" "-fvisibility=hidden" "-DZSTD_DISABLE_ASM=" "-DZSTD_LIB_DEPRECATED=0" "-DXXH_PRIVATE_API=" "-DZSTDLIB_VISIBILITY=" "-DZSTDERRORLIB_VISIBILITY=" "-o" "/opt/rustwide/target/aarch64-apple-darwin/debug/build/zstd-sys/eeb3960467ef0fef/out/fb80479a5fb81f6a-zstdmt_compress.o" "-c" "zstd/lib/compress/zstdmt_compress.c"cargo:warning=cc: error: unrecognized command-line option '-mmacosx-version-min=11.0' [INFO] [stderr] warning: zstd-sys@2.1.0+zstd.1.5.7: ToolExecError: command did not execute successfully (status code exit status: 1): LC_ALL="C" "cc" "-O0" "-ffunction-sections" "-fdata-sections" "-fPIC" "-g" "-gdwarf-2" "-fno-omit-frame-pointer" "-arch" "arm64" "-mmacosx-version-min=11.0" "-I" "zstd/lib/" "-I" "zstd/lib/common" "-w" "-fvisibility=hidden" "-DZSTD_DISABLE_ASM=" "-DZSTD_LIB_DEPRECATED=0" "-DXXH_PRIVATE_API=" "-DZSTDLIB_VISIBILITY=" "-DZSTDERRORLIB_VISIBILITY=" "-o" "/opt/rustwide/target/aarch64-apple-darwin/debug/build/zstd-sys/eeb3960467ef0fef/out/88f362f13b0528ed-huf_decompress.o" "-c" "zstd/lib/decompress/huf_decompress.c"cargo:warning=cc: error: unrecognized command-line option '-mmacosx-version-min=11.0' [INFO] [stderr] warning: zstd-sys@2.1.0+zstd.1.5.7: ToolExecError: command did not execute successfully (status code exit status: 1): LC_ALL="C" "cc" "-O0" "-ffunction-sections" "-fdata-sections" "-fPIC" "-g" "-gdwarf-2" "-fno-omit-frame-pointer" "-arch" "arm64" "-mmacosx-version-min=11.0" "-I" "zstd/lib/" "-I" "zstd/lib/common" "-w" "-fvisibility=hidden" "-DZSTD_DISABLE_ASM=" "-DZSTD_LIB_DEPRECATED=0" "-DXXH_PRIVATE_API=" "-DZSTDLIB_VISIBILITY=" "-DZSTDERRORLIB_VISIBILITY=" "-o" "/opt/rustwide/target/aarch64-apple-darwin/debug/build/zstd-sys/eeb3960467ef0fef/out/88f362f13b0528ed-zstd_ddict.o" "-c" "zstd/lib/decompress/zstd_ddict.c"cargo:warning=cc: error: unrecognized command-line option '-mmacosx-version-min=11.0' [INFO] [stderr] warning: zstd-sys@2.1.0+zstd.1.5.7: ToolExecError: command did not execute successfully (status code exit status: 1): LC_ALL="C" "cc" "-O0" "-ffunction-sections" "-fdata-sections" "-fPIC" "-g" "-gdwarf-2" "-fno-omit-frame-pointer" "-arch" "arm64" "-mmacosx-version-min=11.0" "-I" "zstd/lib/" "-I" "zstd/lib/common" "-w" "-fvisibility=hidden" "-DZSTD_DISABLE_ASM=" "-DZSTD_LIB_DEPRECATED=0" "-DXXH_PRIVATE_API=" "-DZSTDLIB_VISIBILITY=" "-DZSTDERRORLIB_VISIBILITY=" "-o" "/opt/rustwide/target/aarch64-apple-darwin/debug/build/zstd-sys/eeb3960467ef0fef/out/88f362f13b0528ed-zstd_decompress.o" "-c" "zstd/lib/decompress/zstd_decompress.c"cargo:warning=cc: error: unrecognized command-line option '-arch' [INFO] [stderr] warning: zstd-sys@2.1.0+zstd.1.5.7: cc: error: unrecognized command-line option '-mmacosx-version-min=11.0' [INFO] [stderr] warning: zstd-sys@2.1.0+zstd.1.5.7: ToolExecError: command did not execute successfully (status code exit status: 1): LC_ALL="C" "cc" "-O0" "-ffunction-sections" "-fdata-sections" "-fPIC" "-g" "-gdwarf-2" "-fno-omit-frame-pointer" "-arch" "arm64" "-mmacosx-version-min=11.0" "-I" "zstd/lib/" "-I" "zstd/lib/common" "-w" "-fvisibility=hidden" "-DZSTD_DISABLE_ASM=" "-DZSTD_LIB_DEPRECATED=0" "-DXXH_PRIVATE_API=" "-DZSTDLIB_VISIBILITY=" "-DZSTDERRORLIB_VISIBILITY=" "-o" "/opt/rustwide/target/aarch64-apple-darwin/debug/build/zstd-sys/eeb3960467ef0fef/out/88f362f13b0528ed-zstd_decompress_block.o" "-c" "zstd/lib/decompress/zstd_decompress_block.c" [INFO] [stderr] error: failed to run custom build command for `zstd-sys v2.1.0+zstd.1.5.7` [INFO] [stderr] [INFO] [stderr] Caused by: [INFO] [stderr] process didn't exit successfully: `/opt/rustwide/target/debug/build/zstd-sys/dc8f2968b019dc68/out/build_script_build` (exit status: 1) [INFO] [stderr] --- stdout [INFO] [stderr] cargo:rerun-if-env-changed=ZSTD_SYS_USE_PKG_CONFIG [INFO] [stderr] cargo:rerun-if-env-changed=CC_FORCE_DISABLE [INFO] [stderr] CC_FORCE_DISABLE = None [INFO] [stderr] cargo:rerun-if-env-changed=CC_aarch64-apple-darwin [INFO] [stderr] CC_aarch64-apple-darwin = None [INFO] [stderr] cargo:rerun-if-env-changed=CC_aarch64_apple_darwin [INFO] [stderr] CC_aarch64_apple_darwin = None [INFO] [stderr] cargo:rerun-if-env-changed=TARGET_CC [INFO] [stderr] TARGET_CC = None [INFO] [stderr] cargo:rerun-if-env-changed=CC [INFO] [stderr] CC = None [INFO] [stderr] cargo:rerun-if-env-changed=CROSS_COMPILE [INFO] [stderr] CROSS_COMPILE = None [INFO] [stderr] cargo:rerun-if-env-changed=CC_ENABLE_DEBUG_OUTPUT [INFO] [stderr] cargo:rerun-if-env-changed=CRATE_CC_NO_DEFAULTS [INFO] [stderr] CRATE_CC_NO_DEFAULTS = None [INFO] [stderr] cargo:rerun-if-env-changed=CRATE_CC_NO_DEFAULTS [INFO] [stderr] CRATE_CC_NO_DEFAULTS = None [INFO] [stderr] cargo:rerun-if-env-changed=MACOSX_DEPLOYMENT_TARGET [INFO] [stderr] MACOSX_DEPLOYMENT_TARGET = None [INFO] [stderr] cargo:rerun-if-env-changed=CC_ENABLE_DEBUG_OUTPUT [INFO] [stderr] cargo:rerun-if-env-changed=CFLAGS [INFO] [stderr] CFLAGS = None [INFO] [stderr] cargo:rerun-if-env-changed=TARGET_CFLAGS [INFO] [stderr] TARGET_CFLAGS = None [INFO] [stderr] cargo:rerun-if-env-changed=CFLAGS_aarch64_apple_darwin [INFO] [stderr] CFLAGS_aarch64_apple_darwin = None [INFO] [stderr] cargo:rerun-if-env-changed=CFLAGS_aarch64-apple-darwin [INFO] [stderr] CFLAGS_aarch64-apple-darwin = None [INFO] [stderr] cargo:rerun-if-env-changed=CFLAGS [INFO] [stderr] CFLAGS = None [INFO] [stderr] cargo:rerun-if-env-changed=TARGET_CFLAGS [INFO] [stderr] TARGET_CFLAGS = None [INFO] [stderr] cargo:rerun-if-env-changed=CFLAGS_aarch64_apple_darwin [INFO] [stderr] CFLAGS_aarch64_apple_darwin = None [INFO] [stderr] cargo:rerun-if-env-changed=CFLAGS_aarch64-apple-darwin [INFO] [stderr] CFLAGS_aarch64-apple-darwin = None [INFO] [stderr] cargo:rerun-if-env-changed=CRATE_CC_NO_DEFAULTS [INFO] [stderr] CRATE_CC_NO_DEFAULTS = None [INFO] [stderr] cargo:rerun-if-env-changed=CFLAGS [INFO] [stderr] CFLAGS = None [INFO] [stderr] cargo:rerun-if-env-changed=TARGET_CFLAGS [INFO] [stderr] TARGET_CFLAGS = None [INFO] [stderr] cargo:rerun-if-env-changed=CFLAGS_aarch64_apple_darwin [INFO] [stderr] CFLAGS_aarch64_apple_darwin = None [INFO] [stderr] cargo:rerun-if-env-changed=CFLAGS_aarch64-apple-darwin [INFO] [stderr] CFLAGS_aarch64-apple-darwin = None [INFO] [stderr] cargo:rerun-if-env-changed=CRATE_CC_NO_DEFAULTS [INFO] [stderr] CRATE_CC_NO_DEFAULTS = None [INFO] [stderr] cargo:rerun-if-env-changed=CFLAGS [INFO] [stderr] CFLAGS = None [INFO] [stderr] cargo:rerun-if-env-changed=TARGET_CFLAGS [INFO] [stderr] TARGET_CFLAGS = None [INFO] [stderr] cargo:rerun-if-env-changed=CFLAGS_aarch64_apple_darwin [INFO] [stderr] CFLAGS_aarch64_apple_darwin = None [INFO] [stderr] cargo:rerun-if-env-changed=CFLAGS_aarch64-apple-darwin [INFO] [stderr] CFLAGS_aarch64-apple-darwin = None [INFO] [stderr] cargo:rerun-if-env-changed=CRATE_CC_NO_DEFAULTS [INFO] [stderr] CRATE_CC_NO_DEFAULTS = None [INFO] [stderr] cargo:rerun-if-env-changed=CFLAGS [INFO] [stderr] CFLAGS = None [INFO] [stderr] cargo:rerun-if-env-changed=TARGET_CFLAGS [INFO] [stderr] TARGET_CFLAGS = None [INFO] [stderr] cargo:rerun-if-env-changed=CFLAGS_aarch64_apple_darwin [INFO] [stderr] CFLAGS_aarch64_apple_darwin = None [INFO] [stderr] cargo:rerun-if-env-changed=CFLAGS_aarch64-apple-darwin [INFO] [stderr] CFLAGS_aarch64-apple-darwin = None [INFO] [stderr] cargo:rerun-if-env-changed=CC_aarch64-apple-darwin [INFO] [stderr] CC_aarch64-apple-darwin = None [INFO] [stderr] cargo:rerun-if-env-changed=CC_aarch64_apple_darwin [INFO] [stderr] CC_aarch64_apple_darwin = None [INFO] [stderr] cargo:rerun-if-env-changed=TARGET_CC [INFO] [stderr] TARGET_CC = None [INFO] [stderr] cargo:rerun-if-env-changed=CC [INFO] [stderr] CC = None [INFO] [stderr] cargo:rerun-if-env-changed=CROSS_COMPILE [INFO] [stderr] CROSS_COMPILE = None [INFO] [stderr] cargo:rerun-if-env-changed=CRATE_CC_NO_DEFAULTS [INFO] [stderr] CRATE_CC_NO_DEFAULTS = None [INFO] [stderr] cargo:rerun-if-env-changed=CFLAGS [INFO] [stderr] CFLAGS = None [INFO] [stderr] cargo:rerun-if-env-changed=TARGET_CFLAGS [INFO] [stderr] TARGET_CFLAGS = None [INFO] [stderr] cargo:rerun-if-env-changed=CFLAGS_aarch64_apple_darwin [INFO] [stderr] CFLAGS_aarch64_apple_darwin = None [INFO] [stderr] cargo:rerun-if-env-changed=CFLAGS_aarch64-apple-darwin [INFO] [stderr] CFLAGS_aarch64-apple-darwin = None [INFO] [stderr] cargo:rerun-if-env-changed=CC_aarch64-apple-darwin [INFO] [stderr] CC_aarch64-apple-darwin = None [INFO] [stderr] cargo:rerun-if-env-changed=CC_aarch64_apple_darwin [INFO] [stderr] CC_aarch64_apple_darwin = None [INFO] [stderr] cargo:rerun-if-env-changed=TARGET_CC [INFO] [stderr] TARGET_CC = None [INFO] [stderr] cargo:rerun-if-env-changed=CC [INFO] [stderr] CC = None [INFO] [stderr] cargo:rerun-if-env-changed=CROSS_COMPILE [INFO] [stderr] CROSS_COMPILE = None [INFO] [stderr] cargo:rerun-if-env-changed=CRATE_CC_NO_DEFAULTS [INFO] [stderr] CRATE_CC_NO_DEFAULTS = None [INFO] [stderr] cargo:rerun-if-env-changed=CFLAGS [INFO] [stderr] CFLAGS = None [INFO] [stderr] cargo:rerun-if-env-changed=TARGET_CFLAGS [INFO] [stderr] TARGET_CFLAGS = None [INFO] [stderr] cargo:rerun-if-env-changed=CFLAGS_aarch64_apple_darwin [INFO] [stderr] CFLAGS_aarch64_apple_darwin = None [INFO] [stderr] cargo:rerun-if-env-changed=CFLAGS_aarch64-apple-darwin [INFO] [stderr] CFLAGS_aarch64-apple-darwin = None [INFO] [stderr] cargo:warning=cc: error: unrecognized command-line option '-arch' [INFO] [stderr] cargo:warning=cc: error: unrecognized command-line option '-mmacosx-version-min=11.0' [INFO] [stderr] exit status: 1 [INFO] [stderr] cargo:warning=ToolExecError: command did not execute successfully (status code exit status: 1): LC_ALL="C" "cc" "-O0" "-ffunction-sections" "-fdata-sections" "-fPIC" "-g" "-gdwarf-2" "-fno-omit-frame-pointer" "-arch" "arm64" "-mmacosx-version-min=11.0" "-I" "zstd/lib/" "-I" "zstd/lib/common" "-w" "-fvisibility=hidden" "-DZSTD_DISABLE_ASM=" "-DZSTD_LIB_DEPRECATED=0" "-DXXH_PRIVATE_API=" "-DZSTDLIB_VISIBILITY=" "-DZSTDERRORLIB_VISIBILITY=" "-o" "/opt/rustwide/target/aarch64-apple-darwin/debug/build/zstd-sys/eeb3960467ef0fef/out/44ff4c55aa9e5133-debug.o" "-c" "zstd/lib/common/debug.c"cargo:warning=cc: error: unrecognized command-line option '-arch' [INFO] [stderr] cargo:warning=cc: error: unrecognized command-line option '-mmacosx-version-min=11.0' [INFO] [stderr] [INFO] [stderr] exit status: 1 [INFO] [stderr] cargo:warning=ToolExecError: command did not execute successfully (status code exit status: 1): LC_ALL="C" "cc" "-O0" "-ffunction-sections" "-fdata-sections" "-fPIC" "-g" "-gdwarf-2" "-fno-omit-frame-pointer" "-arch" "arm64" "-mmacosx-version-min=11.0" "-I" "zstd/lib/" "-I" "zstd/lib/common" "-w" "-fvisibility=hidden" "-DZSTD_DISABLE_ASM=" "-DZSTD_LIB_DEPRECATED=0" "-DXXH_PRIVATE_API=" "-DZSTDLIB_VISIBILITY=" "-DZSTDERRORLIB_VISIBILITY=" "-o" "/opt/rustwide/target/aarch64-apple-darwin/debug/build/zstd-sys/eeb3960467ef0fef/out/44ff4c55aa9e5133-entropy_common.o" "-c" "zstd/lib/common/entropy_common.c"cargo:rerun-if-env-changed=CC_aarch64-apple-darwin [INFO] [stderr] CC_aarch64-apple-darwin = None [INFO] [stderr] cargo:rerun-if-env-changed=CC_aarch64_apple_darwin [INFO] [stderr] CC_aarch64_apple_darwin = None [INFO] [stderr] cargo:rerun-if-env-changed=TARGET_CC [INFO] [stderr] TARGET_CC = None [INFO] [stderr] cargo:rerun-if-env-changed=CC [INFO] [stderr] CC = None [INFO] [stderr] cargo:rerun-if-env-changed=CROSS_COMPILE [INFO] [stderr] CROSS_COMPILE = None [INFO] [stderr] cargo:rerun-if-env-changed=CRATE_CC_NO_DEFAULTS [INFO] [stderr] CRATE_CC_NO_DEFAULTS = None [INFO] [stderr] cargo:rerun-if-env-changed=CFLAGS [INFO] [stderr] CFLAGS = None [INFO] [stderr] cargo:rerun-if-env-changed=TARGET_CFLAGS [INFO] [stderr] TARGET_CFLAGS = None [INFO] [stderr] cargo:rerun-if-env-changed=CFLAGS_aarch64_apple_darwin [INFO] [stderr] CFLAGS_aarch64_apple_darwin = None [INFO] [stderr] cargo:rerun-if-env-changed=CFLAGS_aarch64-apple-darwin [INFO] [stderr] CFLAGS_aarch64-apple-darwin = None [INFO] [stderr] cargo:rerun-if-env-changed=CC_aarch64-apple-darwin [INFO] [stderr] CC_aarch64-apple-darwin = None [INFO] [stderr] cargo:rerun-if-env-changed=CC_aarch64_apple_darwin [INFO] [stderr] CC_aarch64_apple_darwin = None [INFO] [stderr] cargo:rerun-if-env-changed=TARGET_CC [INFO] [stderr] TARGET_CC = None [INFO] [stderr] cargo:rerun-if-env-changed=CC [INFO] [stderr] CC = None [INFO] [stderr] cargo:rerun-if-env-changed=CROSS_COMPILE [INFO] [stderr] CROSS_COMPILE = None [INFO] [stderr] cargo:rerun-if-env-changed=CRATE_CC_NO_DEFAULTS [INFO] [stderr] CRATE_CC_NO_DEFAULTS = None [INFO] [stderr] cargo:rerun-if-env-changed=CFLAGS [INFO] [stderr] CFLAGS = None [INFO] [stderr] cargo:rerun-if-env-changed=TARGET_CFLAGS [INFO] [stderr] TARGET_CFLAGS = None [INFO] [stderr] cargo:rerun-if-env-changed=CFLAGS_aarch64_apple_darwin [INFO] [stderr] CFLAGS_aarch64_apple_darwin = None [INFO] [stderr] cargo:rerun-if-env-changed=CFLAGS_aarch64-apple-darwin [INFO] [stderr] CFLAGS_aarch64-apple-darwin = None [INFO] [stderr] cargo:warning=cc: error: unrecognized command-line option '-arch' [INFO] [stderr] cargo:warning=cc: error: unrecognized command-line option '-mmacosx-version-min=11.0' [INFO] [stderr] [INFO] [stderr] exit status: 1 [INFO] [stderr] cargo:warning=ToolExecError: command did not execute successfully (status code exit status: 1): LC_ALL="C" "cc" "-O0" "-ffunction-sections" "-fdata-sections" "-fPIC" "-g" "-gdwarf-2" "-fno-omit-frame-pointer" "-arch" "arm64" "-mmacosx-version-min=11.0" "-I" "zstd/lib/" "-I" "zstd/lib/common" "-w" "-fvisibility=hidden" "-DZSTD_DISABLE_ASM=" "-DZSTD_LIB_DEPRECATED=0" "-DXXH_PRIVATE_API=" "-DZSTDLIB_VISIBILITY=" "-DZSTDERRORLIB_VISIBILITY=" "-o" "/opt/rustwide/target/aarch64-apple-darwin/debug/build/zstd-sys/eeb3960467ef0fef/out/44ff4c55aa9e5133-error_private.o" "-c" "zstd/lib/common/error_private.c"cargo:warning=cc: error: unrecognized command-line option '-arch' [INFO] [stderr] cargo:warning=cc: error: unrecognized command-line option '-mmacosx-version-min=11.0' [INFO] [stderr] [INFO] [stderr] exit status: 1 [INFO] [stderr] cargo:warning=ToolExecError: command did not execute successfully (status code exit status: 1): LC_ALL="C" "cc" "-O0" "-ffunction-sections" "-fdata-sections" "-fPIC" "-g" "-gdwarf-2" "-fno-omit-frame-pointer" "-arch" "arm64" "-mmacosx-version-min=11.0" "-I" "zstd/lib/" "-I" "zstd/lib/common" "-w" "-fvisibility=hidden" "-DZSTD_DISABLE_ASM=" "-DZSTD_LIB_DEPRECATED=0" "-DXXH_PRIVATE_API=" "-DZSTDLIB_VISIBILITY=" "-DZSTDERRORLIB_VISIBILITY=" "-o" "/opt/rustwide/target/aarch64-apple-darwin/debug/build/zstd-sys/eeb3960467ef0fef/out/44ff4c55aa9e5133-fse_decompress.o" "-c" "zstd/lib/common/fse_decompress.c"cargo:rerun-if-env-changed=CC_aarch64-apple-darwin [INFO] [stderr] CC_aarch64-apple-darwin = None [INFO] [stderr] cargo:rerun-if-env-changed=CC_aarch64_apple_darwin [INFO] [stderr] CC_aarch64_apple_darwin = None [INFO] [stderr] cargo:rerun-if-env-changed=TARGET_CC [INFO] [stderr] TARGET_CC = None [INFO] [stderr] cargo:rerun-if-env-changed=CC [INFO] [stderr] CC = None [INFO] [stderr] cargo:rerun-if-env-changed=CROSS_COMPILE [INFO] [stderr] CROSS_COMPILE = None [INFO] [stderr] cargo:rerun-if-env-changed=CRATE_CC_NO_DEFAULTS [INFO] [stderr] CRATE_CC_NO_DEFAULTS = None [INFO] [stderr] cargo:rerun-if-env-changed=CFLAGS [INFO] [stderr] CFLAGS = None [INFO] [stderr] cargo:rerun-if-env-changed=TARGET_CFLAGS [INFO] [stderr] TARGET_CFLAGS = None [INFO] [stderr] cargo:rerun-if-env-changed=CFLAGS_aarch64_apple_darwin [INFO] [stderr] CFLAGS_aarch64_apple_darwin = None [INFO] [stderr] cargo:rerun-if-env-changed=CFLAGS_aarch64-apple-darwin [INFO] [stderr] CFLAGS_aarch64-apple-darwin = None [INFO] [stderr] cargo:rerun-if-env-changed=CC_aarch64-apple-darwin [INFO] [stderr] CC_aarch64-apple-darwin = None [INFO] [stderr] cargo:rerun-if-env-changed=CC_aarch64_apple_darwin [INFO] [stderr] CC_aarch64_apple_darwin = None [INFO] [stderr] cargo:rerun-if-env-changed=TARGET_CC [INFO] [stderr] TARGET_CC = None [INFO] [stderr] cargo:rerun-if-env-changed=CC [INFO] [stderr] CC = None [INFO] [stderr] cargo:rerun-if-env-changed=CROSS_COMPILE [INFO] [stderr] CROSS_COMPILE = None [INFO] [stderr] cargo:rerun-if-env-changed=CRATE_CC_NO_DEFAULTS [INFO] [stderr] CRATE_CC_NO_DEFAULTS = None [INFO] [stderr] cargo:rerun-if-env-changed=CFLAGS [INFO] [stderr] CFLAGS = None [WARN] too much data in the log, truncating it