Build failed. If you want to re-trigger a documentation build, you can do it here. You can find more information on docs.rs builds documentation on the builds page.
# error kind ExecutionFailed
# pre-build errors command failed: exit status: 101
# rustc version rustc 1.101.0-nightly (822182db4 2026-10-13)
# docs.rs version docsrs 0.0.0 (435e529e59073c986fa6c2051a1da284fa8b4d8c 2026-10-12 )
# build log [INFO] adding target x86_64-unknown-linux-gnu for toolchain nightly [INFO] running `"rustup" "target" "add" "--toolchain" "nightly" "x86_64-unknown-linux-gnu"` [INFO] [stderr] info: component rust-std is up to date [INFO] running `"docker" "exec" "-e" "SOURCE_DIR=/opt/rustwide/workdir" "-e" "CARGO_HOME=/opt/rustwide/cargo-home" "-e" "RUSTUP_HOME=/opt/rustwide/rustup-home" "-e" "CARGO_TARGET_DIR=/opt/rustwide/target" "-e" "DOCS_RS=1" "-w" "/opt/rustwide/workdir" "--user" "1001:1001" "2da1590c192d04f5426cff74567f82a0611a00f7048dcafdbd4088f6441577c6" "/opt/rustwide/cargo-home/bin/cargo" "+nightly" "rustdoc" "--lib" "-Zrustdoc-map" "--config" "build.rustdocflags=[\"--cfg\", \"docsrs\", \"-Z\", \"unstable-options\", \"--emit=html-non-static-files\", \"--resource-suffix\", \"-20261013-1.101.0-nightly-822182db4\", \"--static-root-path\", \"/-/rustdoc.static/\", \"--extern-html-root-takes-precedence\"]" "--offline" "-Zunstable-options" "--config=doc.extern-map.registries.crates-io=\"https://docs.rs/{pkg_name}/{version}/x86_64-unknown-linux-gnu\"" "-j12" "--target" "x86_64-unknown-linux-gnu" "-Zrustdoc-scrape-examples"` [INFO] [stderr] warning: target filter specified, but no targets matched; this is a no-op [INFO] [stderr] Checking iroh-blobs v0.103.1 [INFO] [stderr] Checking decdn-client v0.1.0 [INFO] [stderr] [INFO] [stderr] thread 'rustc' (7440) panicked at /rustc-dev/822182db4c4a1827256881d8c7aa685f0bcf2b11/compiler/rustc_hir_analysis/src/check/compare_impl_item.rs:2144:64: [INFO] [stderr] DefId::expect_local: `DefId(402:83 ~ iroh_io[9918]::AsyncStreamReader::read::L)` isn't local [INFO] [stderr] stack backtrace: [INFO] [stderr] 0: 0x7ebdeb61c356 - <<std[5973c7964af9b600]::sys::backtrace::BacktraceLock>::print::DisplayBacktrace as core[3b9553ef3b53823b]::fmt::Display>::fmt [INFO] [stderr] 1: 0x7ebdebc0f8cf - core[3b9553ef3b53823b]::fmt::write [INFO] [stderr] 2: 0x7ebdeb632a1c - <std[5973c7964af9b600]::sys::stdio::unix::Stderr as core[3b9553ef3b53823b]::io::write::Write>::write_fmt [INFO] [stderr] 3: 0x7ebdeb5ed3ca - std[5973c7964af9b600]::panicking::default_hook::{closure#0} [INFO] [stderr] 4: 0x7ebdeb60f8b3 - std[5973c7964af9b600]::panicking::default_hook [INFO] [stderr] 5: 0x7ebdea3ad965 - std[5973c7964af9b600]::panicking::update_hook::<alloc[121a7db9d405704b]::boxed::Box<rustc_driver_impl[642e5338f9e9821d]::install_ice_hook::{closure#1}>>::{closure#0} [INFO] [stderr] 6: 0x7ebdeb60fd52 - std[5973c7964af9b600]::panicking::panic_with_hook [INFO] [stderr] 7: 0x7ebdeb5ed482 - std[5973c7964af9b600]::panicking::panic_handler::{closure#0} [INFO] [stderr] 8: 0x7ebdeb5e48b9 - std[5973c7964af9b600]::sys::backtrace::__rust_end_short_backtrace::<std[5973c7964af9b600]::panicking::panic_handler::{closure#0}, !> [INFO] [stderr] 9: 0x7ebdeb5ef1dd - __rustc[3e7819e8f9559761]::rust_begin_unwind [INFO] [stderr] 10: 0x7ebde74440ec - core[3b9553ef3b53823b]::panicking::panic_fmt [INFO] [stderr] 11: 0x7ebdec3735e9 - rustc_hir_analysis[46ea49d74bf95593]::check::compare_impl_item::compare_const_generic_param_types [INFO] [stderr] 12: 0x7ebdec361649 - rustc_hir_analysis[46ea49d74bf95593]::check::compare_impl_item::compare_impl_item [INFO] [stderr] 13: 0x7ebdec35ead7 - rustc_query_impl[e3932da73fb533b]::query_vtables::compare_impl_item::invoke_provider_fn::__rust_begin_short_backtrace [INFO] [stderr] 14: 0x7ebdec77d46f - rustc_query_impl[e3932da73fb533b]::execution::try_execute_query::<rustc_data_structures[c3461be0c5b51291]::vec_cache::VecCache<rustc_span[94d51ae37cfad2df]::def_id::LocalDefId, rustc_middle[50f406ae809bdc6f]::query::erase::ErasedData<[u8; 1usize]>, rustc_middle[50f406ae809bdc6f]::dep_graph::graph::DepNodeIndex>, false> [INFO] [stderr] 15: 0x7ebdec77d115 - rustc_query_impl[e3932da73fb533b]::query_vtables::compare_impl_item::execute_query_non_incr::__rust_end_short_backtrace [INFO] [stderr] 16: 0x7ebdec7805e9 - rustc_hir_analysis[46ea49d74bf95593]::check::check::check_item_type [INFO] [stderr] 17: 0x7ebdec77e078 - rustc_hir_analysis[46ea49d74bf95593]::check::wfcheck::check_well_formed [INFO] [stderr] 18: 0x7ebdec77e059 - rustc_query_impl[e3932da73fb533b]::query_vtables::check_well_formed::invoke_provider_fn::__rust_begin_short_backtrace [INFO] [stderr] 19: 0x7ebdec77d46f - rustc_query_impl[e3932da73fb533b]::execution::try_execute_query::<rustc_data_structures[c3461be0c5b51291]::vec_cache::VecCache<rustc_span[94d51ae37cfad2df]::def_id::LocalDefId, rustc_middle[50f406ae809bdc6f]::query::erase::ErasedData<[u8; 1usize]>, rustc_middle[50f406ae809bdc6f]::dep_graph::graph::DepNodeIndex>, false> [INFO] [stderr] 20: 0x7ebdec77d1d5 - rustc_query_impl[e3932da73fb533b]::query_vtables::check_well_formed::execute_query_non_incr::__rust_end_short_backtrace [INFO] [stderr] 21: 0x7ebdec77aad1 - rustc_hir_analysis[46ea49d74bf95593]::check::wfcheck::check_type_wf [INFO] [stderr] 22: 0x7ebdec77a9cd - rustc_query_impl[e3932da73fb533b]::query_vtables::check_type_wf::invoke_provider_fn::__rust_begin_short_backtrace [INFO] [stderr] 23: 0x7ebdecd8bb04 - rustc_query_impl[e3932da73fb533b]::execution::try_execute_query::<rustc_middle[50f406ae809bdc6f]::query::caches::SingleCache<rustc_middle[50f406ae809bdc6f]::query::erase::ErasedData<[u8; 1usize]>>, false> [INFO] [stderr] 24: 0x7ebdecd8b8ad - rustc_query_impl[e3932da73fb533b]::query_vtables::check_type_wf::execute_query_non_incr::__rust_end_short_backtrace [INFO] [stderr] 25: 0x7ebdec283a1d - rustc_hir_analysis[46ea49d74bf95593]::check_crate [INFO] [stderr] 26: 0x7ebdec296579 - rustc_interface[a68ffc0296649d7b]::passes::analysis [INFO] [stderr] 27: 0x7ebdecd8e01f - rustc_query_impl[e3932da73fb533b]::execution::try_execute_query::<rustc_middle[50f406ae809bdc6f]::query::caches::SingleCache<rustc_middle[50f406ae809bdc6f]::query::erase::ErasedData<[u8; 0usize]>>, false> [INFO] [stderr] 28: 0x7ebdecd8de13 - rustc_query_impl[e3932da73fb533b]::query_vtables::analysis::execute_query_non_incr::__rust_end_short_backtrace [INFO] [stderr] 29: 0x7ebdecf32965 - rustc_interface[a68ffc0296649d7b]::interface::run_compiler::<(), rustc_driver_impl[642e5338f9e9821d]::compiler_entrypoint::{closure#0}>::{closure#2} [INFO] [stderr] 30: 0x7ebdecf60202 - std[5973c7964af9b600]::sys::backtrace::__rust_begin_short_backtrace::<rustc_interface[a68ffc0296649d7b]::util::run_in_thread_with_globals<rustc_interface[a68ffc0296649d7b]::util::run_in_thread_pool_with_globals<rustc_interface[a68ffc0296649d7b]::interface::run_compiler<(), rustc_driver_impl[642e5338f9e9821d]::compiler_entrypoint::{closure#0}>::{closure#2}, ()>::{closure#0}, ()>::{closure#0}::{closure#0}, ()> [INFO] [stderr] 31: 0x7ebdecf5ffad - <std[5973c7964af9b600]::thread::lifecycle::spawn_unchecked<rustc_interface[a68ffc0296649d7b]::util::run_in_thread_with_globals<rustc_interface[a68ffc0296649d7b]::util::run_in_thread_pool_with_globals<rustc_interface[a68ffc0296649d7b]::interface::run_compiler<(), rustc_driver_impl[642e5338f9e9821d]::compiler_entrypoint::{closure#0}>::{closure#2}, ()>::{closure#0}, ()>::{closure#0}::{closure#0}, ()>::{closure#1} as core[3b9553ef3b53823b]::ops::function::FnOnce<()>>::call_once::{shim:vtable#0} [INFO] [stderr] 32: 0x7ebdecf5b3ad - <std[5973c7964af9b600]::sys::thread::unix::Thread>::new::thread_start [INFO] [stderr] 33: 0x7ebde6082dfa - <unknown> [INFO] [stderr] 34: 0x7ebde61165cc - <unknown> [INFO] [stderr] 35: 0x0 - <unknown> [INFO] [stderr] [INFO] [stderr] error: the compiler unexpectedly panicked. This is a bug [INFO] [stderr] [INFO] [stderr] note: we would appreciate a bug report: https://github.com/rust-lang/rust/issues/new?labels=C-bug%2C+I-ICE%2C+T-compiler&template=ice.md [INFO] [stderr] [INFO] [stderr] note: please make sure that you have updated to the latest nightly [INFO] [stderr] [INFO] [stderr] warning: the ICE couldn't be written to `/opt/rustwide/cargo-home/registry/src/index.crates.io-1949cf8c6b5b557f/decdn-client-0.1.0/rustc-ice-2026-10-14T14_51_25-7436.txt`: Read-only file system (os error 30) [INFO] [stderr] [INFO] [stderr] note: rustc 1.101.0-nightly (822182db4 2026-10-13) running on x86_64-unknown-linux-gnu [INFO] [stderr] [INFO] [stderr] note: compiler flags: --crate-type lib -C embed-bitcode=no -C debuginfo=2 [INFO] [stderr] [INFO] [stderr] note: some of the compiler flags provided by cargo are hidden [INFO] [stderr] [INFO] [stderr] query stack during panic: [INFO] [stderr] #0 [compare_impl_item] checking assoc item `ranged_store::<impl at /opt/rustwide/cargo-home/registry/src/index.crates.io-1949cf8c6b5b557f/decdn-client-0.1.0/src/ranged_store.rs:1370:1: 1370:46>::read::{anon_assoc#0}` is compatible with trait definition [INFO] [stderr] #1 [check_well_formed] checking that `ranged_store::<impl at /opt/rustwide/cargo-home/registry/src/index.crates.io-1949cf8c6b5b557f/decdn-client-0.1.0/src/ranged_store.rs:1370:1: 1370:46>` is well-formed [INFO] [stderr] ... and 2 other queries... use `env RUST_BACKTRACE=1` to see the full query stack [INFO] [stderr] [INFO] [stderr] thread 'rustc' (7440) panicked at /rustc-dev/822182db4c4a1827256881d8c7aa685f0bcf2b11/compiler/rustc_hir_analysis/src/check/compare_impl_item.rs:2144:64: [INFO] [stderr] DefId::expect_local: `DefId(402:83 ~ iroh_io[9918]::AsyncStreamReader::read::L)` isn't local [INFO] [stderr] stack backtrace: [INFO] [stderr] 0: 0x7ebdeb61c356 - <<std[5973c7964af9b600]::sys::backtrace::BacktraceLock>::print::DisplayBacktrace as core[3b9553ef3b53823b]::fmt::Display>::fmt [INFO] [stderr] 1: 0x7ebdebc0f8cf - core[3b9553ef3b53823b]::fmt::write [INFO] [stderr] 2: 0x7ebdeb632a1c - <std[5973c7964af9b600]::sys::stdio::unix::Stderr as core[3b9553ef3b53823b]::io::write::Write>::write_fmt [INFO] [stderr] 3: 0x7ebdeb5ed3ca - std[5973c7964af9b600]::panicking::default_hook::{closure#0} [INFO] [stderr] 4: 0x7ebdeb60f8b3 - std[5973c7964af9b600]::panicking::default_hook [INFO] [stderr] 5: 0x7ebdea3ad965 - std[5973c7964af9b600]::panicking::update_hook::<alloc[121a7db9d405704b]::boxed::Box<rustc_driver_impl[642e5338f9e9821d]::install_ice_hook::{closure#1}>>::{closure#0} [INFO] [stderr] 6: 0x7ebdeb60fd52 - std[5973c7964af9b600]::panicking::panic_with_hook [INFO] [stderr] 7: 0x7ebdeb5ed482 - std[5973c7964af9b600]::panicking::panic_handler::{closure#0} [INFO] [stderr] 8: 0x7ebdeb5e48b9 - std[5973c7964af9b600]::sys::backtrace::__rust_end_short_backtrace::<std[5973c7964af9b600]::panicking::panic_handler::{closure#0}, !> [INFO] [stderr] 9: 0x7ebdeb5ef1dd - __rustc[3e7819e8f9559761]::rust_begin_unwind [INFO] [stderr] 10: 0x7ebde74440ec - core[3b9553ef3b53823b]::panicking::panic_fmt [INFO] [stderr] 11: 0x7ebdec3735e9 - rustc_hir_analysis[46ea49d74bf95593]::check::compare_impl_item::compare_const_generic_param_types [INFO] [stderr] 12: 0x7ebdec361649 - rustc_hir_analysis[46ea49d74bf95593]::check::compare_impl_item::compare_impl_item [INFO] [stderr] 13: 0x7ebdec35ead7 - rustc_query_impl[e3932da73fb533b]::query_vtables::compare_impl_item::invoke_provider_fn::__rust_begin_short_backtrace [INFO] [stderr] 14: 0x7ebdec77d46f - rustc_query_impl[e3932da73fb533b]::execution::try_execute_query::<rustc_data_structures[c3461be0c5b51291]::vec_cache::VecCache<rustc_span[94d51ae37cfad2df]::def_id::LocalDefId, rustc_middle[50f406ae809bdc6f]::query::erase::ErasedData<[u8; 1usize]>, rustc_middle[50f406ae809bdc6f]::dep_graph::graph::DepNodeIndex>, false> [INFO] [stderr] 15: 0x7ebdec77d115 - rustc_query_impl[e3932da73fb533b]::query_vtables::compare_impl_item::execute_query_non_incr::__rust_end_short_backtrace [INFO] [stderr] 16: 0x7ebdec7805e9 - rustc_hir_analysis[46ea49d74bf95593]::check::check::check_item_type [INFO] [stderr] 17: 0x7ebdec77e078 - rustc_hir_analysis[46ea49d74bf95593]::check::wfcheck::check_well_formed [INFO] [stderr] 18: 0x7ebdec77e059 - rustc_query_impl[e3932da73fb533b]::query_vtables::check_well_formed::invoke_provider_fn::__rust_begin_short_backtrace [INFO] [stderr] 19: 0x7ebdec77d46f - rustc_query_impl[e3932da73fb533b]::execution::try_execute_query::<rustc_data_structures[c3461be0c5b51291]::vec_cache::VecCache<rustc_span[94d51ae37cfad2df]::def_id::LocalDefId, rustc_middle[50f406ae809bdc6f]::query::erase::ErasedData<[u8; 1usize]>, rustc_middle[50f406ae809bdc6f]::dep_graph::graph::DepNodeIndex>, false> [INFO] [stderr] 20: 0x7ebdec77d1d5 - rustc_query_impl[e3932da73fb533b]::query_vtables::check_well_formed::execute_query_non_incr::__rust_end_short_backtrace [INFO] [stderr] 21: 0x7ebdec77aad1 - rustc_hir_analysis[46ea49d74bf95593]::check::wfcheck::check_type_wf [INFO] [stderr] 22: 0x7ebdec77a9cd - rustc_query_impl[e3932da73fb533b]::query_vtables::check_type_wf::invoke_provider_fn::__rust_begin_short_backtrace [INFO] [stderr] 23: 0x7ebdecd8bb04 - rustc_query_impl[e3932da73fb533b]::execution::try_execute_query::<rustc_middle[50f406ae809bdc6f]::query::caches::SingleCache<rustc_middle[50f406ae809bdc6f]::query::erase::ErasedData<[u8; 1usize]>>, false> [INFO] [stderr] 24: 0x7ebdecd8b8ad - rustc_query_impl[e3932da73fb533b]::query_vtables::check_type_wf::execute_query_non_incr::__rust_end_short_backtrace [INFO] [stderr] 25: 0x7ebdec283a1d - rustc_hir_analysis[46ea49d74bf95593]::check_crate [INFO] [stderr] 26: 0x7ebdec296579 - rustc_interface[a68ffc0296649d7b]::passes::analysis [INFO] [stderr] 27: 0x7ebdecd8e01f - rustc_query_impl[e3932da73fb533b]::execution::try_execute_query::<rustc_middle[50f406ae809bdc6f]::query::caches::SingleCache<rustc_middle[50f406ae809bdc6f]::query::erase::ErasedData<[u8; 0usize]>>, false> [INFO] [stderr] 28: 0x7ebdecd8de13 - rustc_query_impl[e3932da73fb533b]::query_vtables::analysis::execute_query_non_incr::__rust_end_short_backtrace [INFO] [stderr] 29: 0x7ebdecf32965 - rustc_interface[a68ffc0296649d7b]::interface::run_compiler::<(), rustc_driver_impl[642e5338f9e9821d]::compiler_entrypoint::{closure#0}>::{closure#2} [INFO] [stderr] 30: 0x7ebdecf60202 - std[5973c7964af9b600]::sys::backtrace::__rust_begin_short_backtrace::<rustc_interface[a68ffc0296649d7b]::util::run_in_thread_with_globals<rustc_interface[a68ffc0296649d7b]::util::run_in_thread_pool_with_globals<rustc_interface[a68ffc0296649d7b]::interface::run_compiler<(), rustc_driver_impl[642e5338f9e9821d]::compiler_entrypoint::{closure#0}>::{closure#2}, ()>::{closure#0}, ()>::{closure#0}::{closure#0}, ()> [INFO] [stderr] 31: 0x7ebdecf5ffad - <std[5973c7964af9b600]::thread::lifecycle::spawn_unchecked<rustc_interface[a68ffc0296649d7b]::util::run_in_thread_with_globals<rustc_interface[a68ffc0296649d7b]::util::run_in_thread_pool_with_globals<rustc_interface[a68ffc0296649d7b]::interface::run_compiler<(), rustc_driver_impl[642e5338f9e9821d]::compiler_entrypoint::{closure#0}>::{closure#2}, ()>::{closure#0}, ()>::{closure#0}::{closure#0}, ()>::{closure#1} as core[3b9553ef3b53823b]::ops::function::FnOnce<()>>::call_once::{shim:vtable#0} [INFO] [stderr] 32: 0x7ebdecf5b3ad - <std[5973c7964af9b600]::sys::thread::unix::Thread>::new::thread_start [INFO] [stderr] 33: 0x7ebde6082dfa - <unknown> [INFO] [stderr] 34: 0x7ebde61165cc - <unknown> [INFO] [stderr] 35: 0x0 - <unknown> [INFO] [stderr] [INFO] [stderr] error: the compiler unexpectedly panicked. This is a bug [INFO] [stderr] [INFO] [stderr] note: we would appreciate a bug report: https://github.com/rust-lang/rust/issues/new?labels=C-bug%2C+I-ICE%2C+T-compiler&template=ice.md [INFO] [stderr] [INFO] [stderr] note: please make sure that you have updated to the latest nightly [INFO] [stderr] [INFO] [stderr] warning: the ICE couldn't be written to `/opt/rustwide/cargo-home/registry/src/index.crates.io-1949cf8c6b5b557f/decdn-client-0.1.0/rustc-ice-2026-10-14T14_51_25-7436.txt`: Read-only file system (os error 30) [INFO] [stderr] [INFO] [stderr] note: rustc 1.101.0-nightly (822182db4 2026-10-13) running on x86_64-unknown-linux-gnu [INFO] [stderr] [INFO] [stderr] note: compiler flags: --crate-type lib -C embed-bitcode=no -C debuginfo=2 [INFO] [stderr] [INFO] [stderr] note: some of the compiler flags provided by cargo are hidden [INFO] [stderr] [INFO] [stderr] query stack during panic: [INFO] [stderr] #0 [compare_impl_item] checking assoc item `sink::<impl at /opt/rustwide/cargo-home/registry/src/index.crates.io-1949cf8c6b5b557f/decdn-client-0.1.0/src/sink.rs:115:1: 115:47>::read::{anon_assoc#0}` is compatible with trait definition [INFO] [stderr] #1 [check_well_formed] checking that `sink::<impl at /opt/rustwide/cargo-home/registry/src/index.crates.io-1949cf8c6b5b557f/decdn-client-0.1.0/src/sink.rs:115:1: 115:47>` is well-formed [INFO] [stderr] ... and 2 other queries... use `env RUST_BACKTRACE=1` to see the full query stack [INFO] [stderr] error: could not compile `decdn-client` (lib) [INFO] [stderr] [INFO] [stderr] Caused by: [INFO] [stderr] process didn't exit successfully: `/opt/rustwide/rustup-home/toolchains/nightly-x86_64-unknown-linux-gnu/bin/rustc --crate-name decdn_client --edition=2024 /opt/rustwide/cargo-home/registry/src/index.crates.io-1949cf8c6b5b557f/decdn-client-0.1.0/src/lib.rs --error-format=json --json=diagnostic-rendered-ansi,artifacts,future-incompat,unused-externs-silent --crate-type lib --emit=dep-info,metadata -C embed-bitcode=no -C debuginfo=2 --check-cfg 'cfg(docsrs,test)' --check-cfg 'cfg(feature, values("public-api-test", "test-util"))' -C metadata=1b334bbf9c55fccb -C extra-filename=-5241d1863db194ad --out-dir /opt/rustwide/target/x86_64-unknown-linux-gnu/debug/build/decdn-client/5241d1863db194ad/out --target x86_64-unknown-linux-gnu -L dependency=/opt/rustwide/target/debug/build/alloy-rlp-derive/0493697673472f39/out -L dependency=/opt/rustwide/target/debug/build/alloy-sol-macro/685eabf3d2bf0732/out -L dependency=/opt/rustwide/target/debug/build/alloy-tx-macros/27b4030cf302c739/out -L dependency=/opt/rustwide/target/debug/build/async-stream-impl/bd7f1fc1a6e3252b/out -L dependency=/opt/rustwide/target/debug/build/async-trait/1c4f318428b8617e/out -L dependency=/opt/rustwide/target/debug/build/auto_impl/e7d2a67e5176927c/out -L dependency=/opt/rustwide/target/debug/build/clap_derive/280bf7993d60535b/out -L dependency=/opt/rustwide/target/debug/build/curve25519-dalek-derive/155eac830ac387b7/out -L dependency=/opt/rustwide/target/debug/build/data-encoding-macro-internal/f1f8d38530100a35/out -L dependency=/opt/rustwide/target/debug/build/derive_more-impl/cadff2913b7c0c35/out -L dependency=/opt/rustwide/target/debug/build/displaydoc/22c212ce809178d6/out -L dependency=/opt/rustwide/target/debug/build/enum-assoc/557dcd93a5c3abb7/out -L dependency=/opt/rustwide/target/debug/build/futures-macro/7f1d7ec9a24bf6c2/out -L dependency=/opt/rustwide/target/debug/build/genawaiter-proc-macro/fd8bee133e2347e4/out -L dependency=/opt/rustwide/target/debug/build/iroh-metrics-derive/c290eb5213de683f/out -L dependency=/opt/rustwide/target/debug/build/jsonrpsee-proc-macros/03863f04ad290ea8/out -L dependency=/opt/rustwide/target/debug/build/n0-error-macros/4384deaec690be3e/out -L dependency=/opt/rustwide/target/debug/build/num_enum_derive/e302210281b298bc/out -L dependency=/opt/rustwide/target/debug/build/paste/35f047675a76880e/out -L dependency=/opt/rustwide/target/debug/build/pin-project-internal/d796bfe7368f500b/out -L dependency=/opt/rustwide/target/debug/build/postcard-derive/8ee52a45bad2625a/out -L dependency=/opt/rustwide/target/debug/build/proc-macro-hack/2e5620a2726e57c1/out -L dependency=/opt/rustwide/target/debug/build/ref-cast-impl/9e959649f8266af4/out -L dependency=/opt/rustwide/target/debug/build/ruint-macro/a0eecb5ef5e37c8f/out -L dependency=/opt/rustwide/target/debug/build/rustversion/acea2b2ba54cc62b/out -L dependency=/opt/rustwide/target/debug/build/serde_derive/9007dad461fddfed/out -L dependency=/opt/rustwide/target/debug/build/serde_with_macros/e73696d4e2b414bf/out -L dependency=/opt/rustwide/target/debug/build/spez/d92032d14cdbb4d8/out -L dependency=/opt/rustwide/target/debug/build/strum_macros/94abbb1a4623feb5/out -L dependency=/opt/rustwide/target/debug/build/thiserror-impl/06ca0708de0b6119/out -L dependency=/opt/rustwide/target/debug/build/thiserror-impl/6253bd2335cfa47a/out -L dependency=/opt/rustwide/target/debug/build/tokio-macros/3e6cce02bbab7760/out -L dependency=/opt/rustwide/target/debug/build/tracing-attributes/6150e7d6d12ebfe2/out -L dependency=/opt/rustwide/target/debug/build/yoke-derive/c7e15ffda042b5dd/out -L dependency=/opt/rustwide/target/debug/build/zerocopy-derive/38ce49af96a155bb/out -L dependency=/opt/rustwide/target/debug/build/zerofrom-derive/176ee5a6758cc0e9/out -L dependency=/opt/rustwide/target/debug/build/zeroize_derive/d9f97fe268fe8e39/out -L dependency=/opt/rustwide/target/debug/build/zerovec-derive/7e91ae35670fdc63/out -L dependency=/opt/rustwide/target/x86_64-unknown-linux-gnu/debug/build/aead/8667080e2a54e494/out -L dependency=/opt/rustwide/target/x86_64-unknown-linux-gnu/debug/build/aes-gcm/3719d616aeba4d2c/out -L dependency=/opt/rustwide/target/x86_64-unknown-linux-gnu/debug/build/aes/ecd6f605dc99d239/out -L dependency=/opt/rustwide/target/x86_64-unknown-linux-gnu/debug/build/alloy-chains/e4f5add629a0d426/out -L dependency=/opt/rustwide/target/x86_64-unknown-linux-gnu/debug/build/alloy-consensus-any/18078c2c8e691747/out -L dependency=/opt/rustwide/target/x86_64-unknown-linux-gnu/debug/build/alloy-consensus/15d55eda555e38f7/out -L dependency=/opt/rustwide/target/x86_64-unknown-linux-gnu/debug/build/alloy-contract/994ddd9103d1f478/out -L dependency=/opt/rustwide/target/x86_64-unknown-linux-gnu/debug/build/alloy-core/4b811ee81d2a0610/out -L dependency=/opt/rustwide/target/x86_64-unknown-linux-gnu/debug/build/alloy-dyn-abi/f1eaef27a0dc853b/out -L dependency=/opt/rustwide/target/x86_64-unknown-linux-gnu/debug/build/alloy-eip2124/d4dffb6a42677e6f/out -L dependency=/opt/rustwide/target/x86_64-unknown-linux-gnu/debug/build/alloy-eip2930/9e3d11a02e6357cb/out -L dependency=/opt/rustwide/target/x86_64-unknown-linux-gnu/debug/build/alloy-eip7702/348fb2c48bbac929/out -L dependency=/opt/rustwide/target/x86_64-unknown-linux-gnu/debug/build/alloy-eip7928/bf59315cd0327f71/out -L dependency=/opt/rustwide/target/x86_64-unknown-linux-gnu/debug/build/alloy-eip8141/d1ca592ccbde7ff5/out -L dependency=/opt/rustwide/target/x86_64-unknown-linux-gnu/debug/build/alloy-eips/3e138664c9f8eb03/out -L dependency=/opt/rustwide/target/x86_64-unknown-linux-gnu/debug/build/alloy-json-abi/2bb15f8141e7e479/out -L dependency=/opt/rustwide/target/x86_64-unknown-linux-gnu/debug/build/alloy-json-rpc/c6b99cb57356fc80/out -L dependency=/opt/rustwide/target/x86_64-unknown-linux-gnu/debug/build/alloy-network-primitives/cba7b74c1ac4fe4c/out -L dependency=/opt/rustwide/target/x86_64-unknown-linux-gnu/debug/build/alloy-network/9c05c62d0c2ad075/out -L dependency=/opt/rustwide/target/x86_64-unknown-linux-gnu/debug/build/alloy-primitives/564fbf82c24e71c8/out -L dependency=/opt/rustwide/target/x86_64-unknown-linux-gnu/debug/build/alloy-provider/a89e71b7c95dd876/out -L dependency=/opt/rustwide/target/x86_64-unknown-linux-gnu/debug/build/alloy-rlp/13e476dd5f10144b/out -L dependency=/opt/rustwide/target/x86_64-unknown-linux-gnu/debug/build/alloy-rpc-client/8e9e5a45b9448f8c/out -L dependency=/opt/rustwide/target/x86_64-unknown-linux-gnu/debug/build/alloy-rpc-types-any/3bdc2c5110ce2da8/out -L dependency=/opt/rustwide/target/x86_64-unknown-linux-gnu/debug/build/alloy-rpc-types-eth/ff630fd62a1098f9/out -L dependency=/opt/rustwide/target/x86_64-unknown-linux-gnu/debug/build/alloy-rpc-types/178c37feb5eda21a/out -L dependency=/opt/rustwide/target/x86_64-unknown-linux-gnu/debug/build/alloy-serde/5bdb6452dd4bebee/out -L dependency=/opt/rustwide/target/x86_64-unknown-linux-gnu/debug/build/alloy-signer-local/57b2520f7faa81e9/out -L dependency=/opt/rustwide/target/x86_64-unknown-linux-gnu/debug/build/alloy-signer/3d6f33ea6a3d6ae4/out -L dependency=/opt/rustwide/target/x86_64-unknown-linux-gnu/debug/build/alloy-sol-type-parser/296daf2edeb0cf98/out -L dependency=/opt/rustwide/target/x86_64-unknown-linux-gnu/debug/build/alloy-sol-types/a2251187461b005a/out -L dependency=/opt/rustwide/target/x86_64-unknown-linux-gnu/debug/build/alloy-transport-http/38c23c2c9e9875df/out -L dependency=/opt/rustwide/target/x86_64-unknown-linux-gnu/debug/build/alloy-transport/905b8a69b9109320/out -L dependency=/opt/rustwide/target/x86_64-unknown-linux-gnu/debug/build/alloy-trie/a6a0bb63c177358d/out -L dependency=/opt/rustwide/target/x86_64-unknown-linux-gnu/debug/build/alloy/51b2cb65b6fdfc4d/out -L dependency=/opt/rustwide/target/x86_64-unknown-linux-gnu/debug/build/anstream/6302e651d6cf1fd7/out -L dependency=/opt/rustwide/target/x86_64-unknown-linux-gnu/debug/build/anstyle-parse/77df5e77794616d0/out -L dependency=/opt/rustwide/target/x86_64-unknown-linux-gnu/debug/build/anstyle-query/c735efbb0a5c21ae/out -L dependency=/opt/rustwide/target/x86_64-unknown-linux-gnu/debug/build/anstyle/3e3f50b6b4133d6d/out -L dependency=/opt/rustwide/target/x86_64-unknown-linux-gnu/debug/build/anyhow/dc2bfc1937e0573f/out -L dependency=/opt/rustwide/target/x86_64-unknown-linux-gnu/debug/build/arc-swap/30a9b7de34df27f0/out -L dependency=/opt/rustwide/target/x86_64-unknown-linux-gnu/debug/build/arrayvec/9f21e2a39592551c/out -L dependency=/opt/rustwide/target/x86_64-unknown-linux-gnu/debug/build/async-stream/087d65d37285324b/out -L dependency=/opt/rustwide/target/x86_64-unknown-linux-gnu/debug/build/atomic-waker/1ee4dd6b35016bce/out -L dependency=/opt/rustwide/target/x86_64-unknown-linux-gnu/debug/build/attohttpc/edf2050c01b4449e/out -L dependency=/opt/rustwide/target/x86_64-unknown-linux-gnu/debug/build/aws-lc-rs/25a73ad4d0c8a834/out -L dependency=/opt/rustwide/target/x86_64-unknown-linux-gnu/debug/build/aws-lc-sys/8c7ff64fd64f16cb/out -L dependency=/opt/rustwide/target/x86_64-unknown-linux-gnu/debug/build/backon/fc354504e4bebb0e/out -L dependency=/opt/rustwide/target/x86_64-unknown-linux-gnu/debug/build/bao-tree/6dc29b87cb9a2e58/out -L dependency=/opt/rustwide/target/x86_64-unknown-linux-gnu/debug/build/base16ct/bb852e19c5b64aaf/out -L dependency=/opt/rustwide/target/x86_64-unknown-linux-gnu/debug/build/base16ct/f25808b910e3d123/out -L dependency=/opt/rustwide/target/x86_64-unknown-linux-gnu/debug/build/base64/8d462520111e2cd1/out -L dependency=/opt/rustwide/target/x86_64-unknown-linux-gnu/debug/build/base64/b79286c55b8ddc46/out -L dependency=/opt/rustwide/target/x86_64-unknown-linux-gnu/debug/build/base64ct/8f4a5f50fda948fe/out -L dependency=/opt/rustwide/target/x86_64-unknown-linux-gnu/debug/build/binary-merge/b841afada2750091/out -L dependency=/opt/rustwide/target/x86_64-unknown-linux-gnu/debug/build/bitflags/6d8a34f97d43cf17/out -L dependency=/opt/rustwide/target/x86_64-unknown-linux-gnu/debug/build/blake3/4bbca398572a43c5/out -L dependency=/opt/rustwide/target/x86_64-unknown-linux-gnu/debug/build/block-buffer/38eec9b221c3ebfc/out -L dependency=/opt/rustwide/target/x86_64-unknown-linux-gnu/debug/build/block-buffer/3c78bc3af296ecb5/out -L dependency=/opt/rustwide/target/x86_64-unknown-linux-gnu/debug/build/byteorder/d6ea1a268a71e2df/out -L dependency=/opt/rustwide/target/x86_64-unknown-linux-gnu/debug/build/bytes/ab70f24944cb3baa/out -L dependency=/opt/rustwide/target/x86_64-unknown-linux-gnu/debug/build/cfg-if/64129bc9a783b30c/out -L dependency=/opt/rustwide/target/x86_64-unknown-linux-gnu/debug/build/chacha20/74ea5ea1f4d8cc1c/out -L dependency=/opt/rustwide/target/x86_64-unknown-linux-gnu/debug/build/cipher/4579deaf94d93ce0/out -L dependency=/opt/rustwide/target/x86_64-unknown-linux-gnu/debug/build/cipher/d9da67ad32a1aef1/out -L dependency=/opt/rustwide/target/x86_64-unknown-linux-gnu/debug/build/clap/b6fb43c0bd202dd3/out -L dependency=/opt/rustwide/target/x86_64-unknown-linux-gnu/debug/build/clap_builder/13dad117f5db70e7/out -L dependency=/opt/rustwide/target/x86_64-unknown-linux-gnu/debug/build/clap_lex/dc8105e08eba0757/out -L dependency=/opt/rustwide/target/x86_64-unknown-linux-gnu/debug/build/cmov/1350031ff0a9e2e4/out -L dependency=/opt/rustwide/target/x86_64-unknown-linux-gnu/debug/build/cobs/e6947917cbf9df27/out -L dependency=/opt/rustwide/target/x86_64-unknown-linux-gnu/debug/build/colorchoice/57b12475a6a6ce5f/out -L dependency=/opt/rustwide/target/x86_64-unknown-linux-gnu/debug/build/const-hex/2ece1b97c210fea8/out -L dependency=/opt/rustwide/target/x86_64-unknown-linux-gnu/debug/build/const-oid/9149278e8e27009c/out -L dependency=/opt/rustwide/target/x86_64-unknown-linux-gnu/debug/build/const-oid/c2523e00a8d3a2f8/out -L dependency=/opt/rustwide/target/x86_64-unknown-linux-gnu/debug/build/constant_time_eq/55dc0f72bc989d95/out -L dependency=/opt/rustwide/target/x86_64-unknown-linux-gnu/debug/build/cordyceps/03f969f1410a7908/out -L dependency=/opt/rustwide/target/x86_64-unknown-linux-gnu/debug/build/cpufeatures/1b29d03fefd94e58/out -L dependency=/opt/rustwide/target/x86_64-unknown-linux-gnu/debug/build/cpufeatures/9cedb47b9aea73c1/out -L dependency=/opt/rustwide/target/x86_64-unknown-linux-gnu/debug/build/crc-catalog/1ef00c6324155be4/out -L dependency=/opt/rustwide/target/x86_64-unknown-linux-gnu/debug/build/crc/5b4a6150501ad7f6/out -L dependency=/opt/rustwide/target/x86_64-unknown-linux-gnu/debug/build/crossbeam-utils/a3270cfe9b211130/out -L dependency=/opt/rustwide/target/x86_64-unknown-linux-gnu/debug/build/crypto-bigint/f80c3d49e283af9f/out -L dependency=/opt/rustwide/target/x86_64-unknown-linux-gnu/debug/build/crypto-common/64b483f4d8b653b6/out -L dependency=/opt/rustwide/target/x86_64-unknown-linux-gnu/debug/build/crypto-common/6fff261fa0a98a05/out -L dependency=/opt/rustwide/target/x86_64-unknown-linux-gnu/debug/build/ctr/5f4f4432499c2c2c/out -L dependency=/opt/rustwide/target/x86_64-unknown-linux-gnu/debug/build/ctutils/4f7e57934cf565f6/out -L dependency=/opt/rustwide/target/x86_64-unknown-linux-gnu/debug/build/curve25519-dalek/4bf34550f488f7c8/out -L dependency=/opt/rustwide/target/x86_64-unknown-linux-gnu/debug/build/dashmap/35739ed217841204/out -L dependency=/opt/rustwide/target/x86_64-unknown-linux-gnu/debug/build/data-encoding-macro/67b4cc493d8fc45b/out -L dependency=/opt/rustwide/target/x86_64-unknown-linux-gnu/debug/build/data-encoding/a04a226ffa91c805/out -L dependency=/opt/rustwide/target/x86_64-unknown-linux-gnu/debug/build/decdn-common/c1f2199947dff77a/out -L dependency=/opt/rustwide/target/x86_64-unknown-linux-gnu/debug/build/decdn-config-types/d72023ee2a764950/out -L dependency=/opt/rustwide/target/x86_64-unknown-linux-gnu/debug/build/decdn-protocol/7e06752e9575d239/out -L dependency=/opt/rustwide/target/x86_64-unknown-linux-gnu/debug/build/der/568d3bf3b9931e1d/out -L dependency=/opt/rustwide/target/x86_64-unknown-linux-gnu/debug/build/der/a5631daff0b243e9/out -L dependency=/opt/rustwide/target/x86_64-unknown-linux-gnu/debug/build/deranged/ffe6735ef62095e9/out -L dependency=/opt/rustwide/target/x86_64-unknown-linux-gnu/debug/build/derive_more/83777f6539cdd8b4/out -L dependency=/opt/rustwide/target/x86_64-unknown-linux-gnu/debug/build/diatomic-waker/cad97b42acae04ad/out -L dependency=/opt/rustwide/target/x86_64-unknown-linux-gnu/debug/build/digest/6aa9d66b1adbdb7a/out -L dependency=/opt/rustwide/target/x86_64-unknown-linux-gnu/debug/build/digest/f626ffd59ca241ff/out -L dependency=/opt/rustwide/target/x86_64-unknown-linux-gnu/debug/build/dirs-sys/9a47d64e4fd4b222/out -L dependency=/opt/rustwide/target/x86_64-unknown-linux-gnu/debug/build/dirs/f20d2df714438236/out -L dependency=/opt/rustwide/target/x86_64-unknown-linux-gnu/debug/build/ecdsa/30def8bb325384ec/out -L dependency=/opt/rustwide/target/x86_64-unknown-linux-gnu/debug/build/ed25519-dalek/8362e1a468539599/out -L dependency=/opt/rustwide/target/x86_64-unknown-linux-gnu/debug/build/ed25519/c0bd6d67185aa8ce/out -L dependency=/opt/rustwide/target/x86_64-unknown-linux-gnu/debug/build/either/5fd6c76382a39e82/out -L dependency=/opt/rustwide/target/x86_64-unknown-linux-gnu/debug/build/elliptic-curve/311656fe1ee03fe4/out -L dependency=/opt/rustwide/target/x86_64-unknown-linux-gnu/debug/build/equivalent/8b1865dbc8aad91e/out -L dependency=/opt/rustwide/target/x86_64-unknown-linux-gnu/debug/build/errno/5de176a863cbc9df/out -L dependency=/opt/rustwide/target/x86_64-unknown-linux-gnu/debug/build/eth-keystore/c8d825e118e584d2/out -L dependency=/opt/rustwide/target/x86_64-unknown-linux-gnu/debug/build/fastbloom/5ce235adf01ed88c/out -L dependency=/opt/rustwide/target/x86_64-unknown-linux-gnu/debug/build/fastrand/e74e88e9c3940414/out -L dependency=/opt/rustwide/target/x86_64-unknown-linux-gnu/debug/build/ff/a9003989f8cc1c42/out -L dependency=/opt/rustwide/target/x86_64-unknown-linux-gnu/debug/build/fnv/7d1ab06971bea2e2/out -L dependency=/opt/rustwide/target/x86_64-unknown-linux-gnu/debug/build/foldhash/b35b53f250b14695/out -L dependency=/opt/rustwide/target/x86_64-unknown-linux-gnu/debug/build/form_urlencoded/0db4b226e86524ed/out -L dependency=/opt/rustwide/target/x86_64-unknown-linux-gnu/debug/build/fs4/b0e21aaf1d8ebc51/out -L dependency=/opt/rustwide/target/x86_64-unknown-linux-gnu/debug/build/futures-buffered/4e0ea650822c50b3/out -L dependency=/opt/rustwide/target/x86_64-unknown-linux-gnu/debug/build/futures-channel/87aad13054c52865/out -L dependency=/opt/rustwide/target/x86_64-unknown-linux-gnu/debug/build/futures-core/7f6dd8c80ce6e5b4/out -L dependency=/opt/rustwide/target/x86_64-unknown-linux-gnu/debug/build/futures-executor/9a323e0dc2cf0afd/out -L dependency=/opt/rustwide/target/x86_64-unknown-linux-gnu/debug/build/futures-io/598c8bf06e0927c4/out -L dependency=/opt/rustwide/target/x86_64-unknown-linux-gnu/debug/build/futures-lite/b8c7fcaee839cc43/out -L dependency=/opt/rustwide/target/x86_64-unknown-linux-gnu/debug/build/futures-sink/8aa5cb0c3e6e7d04/out -L dependency=/opt/rustwide/target/x86_64-unknown-linux-gnu/debug/build/futures-task/57a6967e73f83fae/out -L dependency=/opt/rustwide/target/x86_64-unknown-linux-gnu/debug/build/futures-util/b11152f7f4318d24/out -L dependency=/opt/rustwide/target/x86_64-unknown-linux-gnu/debug/build/futures-utils-wasm/5097f2ac5cff9f29/out -L dependency=/opt/rustwide/target/x86_64-unknown-linux-gnu/debug/build/futures/46aa0e6d8f48c3d6/out -L dependency=/opt/rustwide/target/x86_64-unknown-linux-gnu/debug/build/genawaiter-macro/9f5116aa80aaecc3/out -L dependency=/opt/rustwide/target/x86_64-unknown-linux-gnu/debug/build/genawaiter/dd9d5252365baf27/out -L dependency=/opt/rustwide/target/x86_64-unknown-linux-gnu/debug/build/generic-array/4f106d5832c4c16b/out -L dependency=/opt/rustwide/target/x86_64-unknown-linux-gnu/debug/build/getrandom/3b705ec22bc94c95/out -L dependency=/opt/rustwide/target/x86_64-unknown-linux-gnu/debug/build/getrandom/67226291ef75640c/out -L dependency=/opt/rustwide/target/x86_64-unknown-linux-gnu/debug/build/getrandom/743537f187a6d7e8/out -L dependency=/opt/rustwide/target/x86_64-unknown-linux-gnu/debug/build/ghash/4f1afccd689fe136/out -L dependency=/opt/rustwide/target/x86_64-unknown-linux-gnu/debug/build/group/614b2103dff56546/out -L dependency=/opt/rustwide/target/x86_64-unknown-linux-gnu/debug/build/h2/75abb744fb960cde/out -L dependency=/opt/rustwide/target/x86_64-unknown-linux-gnu/debug/build/hash32/bb1cc7afe26e53c6/out -L dependency=/opt/rustwide/target/x86_64-unknown-linux-gnu/debug/build/hashbrown/9f806b02e1f3dbed/out -L dependency=/opt/rustwide/target/x86_64-unknown-linux-gnu/debug/build/hashbrown/e2338f3c3676ca22/out -L dependency=/opt/rustwide/target/x86_64-unknown-linux-gnu/debug/build/heapless/d4c5dea1e317951e/out -L dependency=/opt/rustwide/target/x86_64-unknown-linux-gnu/debug/build/hex/44f3b3add99d6f16/out -L dependency=/opt/rustwide/target/x86_64-unknown-linux-gnu/debug/build/hmac/59e78e7eceb3d630/out -L dependency=/opt/rustwide/target/x86_64-unknown-linux-gnu/debug/build/http-body-util/c1638f01ec384ba2/out -L dependency=/opt/rustwide/target/x86_64-unknown-linux-gnu/debug/build/http-body/973af3feb98514e8/out -L dependency=/opt/rustwide/target/x86_64-unknown-linux-gnu/debug/build/http/728321c908c7a3b3/out -L dependency=/opt/rustwide/target/x86_64-unknown-linux-gnu/debug/build/httparse/6c5802cd412b1799/out -L dependency=/opt/rustwide/target/x86_64-unknown-linux-gnu/debug/build/httpdate/48501241ba6d0f9e/out -L dependency=/opt/rustwide/target/x86_64-unknown-linux-gnu/debug/build/hybrid-array/ab5b2357a054c384/out -L dependency=/opt/rustwide/target/x86_64-unknown-linux-gnu/debug/build/hyper-rustls/390fa9170a945989/out -L dependency=/opt/rustwide/target/x86_64-unknown-linux-gnu/debug/build/hyper-util/def490df7d0fd47f/out -L dependency=/opt/rustwide/target/x86_64-unknown-linux-gnu/debug/build/hyper/b42f731ebce002d3/out -L dependency=/opt/rustwide/target/x86_64-unknown-linux-gnu/debug/build/icu_collections/75cf890a1a478e47/out -L dependency=/opt/rustwide/target/x86_64-unknown-linux-gnu/debug/build/icu_locale_core/2bc3994d5d4f4fd1/out -L dependency=/opt/rustwide/target/x86_64-unknown-linux-gnu/debug/build/icu_normalizer/ad0ad92dfaf450c8/out -L dependency=/opt/rustwide/target/x86_64-unknown-linux-gnu/debug/build/icu_normalizer_data/de33df044702a225/out -L dependency=/opt/rustwide/target/x86_64-unknown-linux-gnu/debug/build/icu_properties/1efbd2a4a4db4342/out -L dependency=/opt/rustwide/target/x86_64-unknown-linux-gnu/debug/build/icu_properties_data/7dac26fb7a566c04/out -L dependency=/opt/rustwide/target/x86_64-unknown-linux-gnu/debug/build/icu_provider/b97d18d78033e0e5/out -L dependency=/opt/rustwide/target/x86_64-unknown-linux-gnu/debug/build/identity-hash/73e6f9d05086cfdc/out -L dependency=/opt/rustwide/target/x86_64-unknown-linux-gnu/debug/build/idna/fc49f558b868d664/out -L dependency=/opt/rustwide/target/x86_64-unknown-linux-gnu/debug/build/idna_adapter/e198a23892ac4e69/out -L dependency=/opt/rustwide/target/x86_64-unknown-linux-gnu/debug/build/igd-next/cd555f290289abab/out -L dependency=/opt/rustwide/target/x86_64-unknown-linux-gnu/debug/build/indexmap/259764cd554cc8c0/out -L dependency=/opt/rustwide/target/x86_64-unknown-linux-gnu/debug/build/inout/2aedaf9b92686295/out -L dependency=/opt/rustwide/target/x86_64-unknown-linux-gnu/debug/build/inout/f5544dcca26c4580/out -L dependency=/opt/rustwide/target/x86_64-unknown-linux-gnu/debug/build/inplace-vec-builder/cf00a02576f7af81/out -L dependency=/opt/rustwide/target/x86_64-unknown-linux-gnu/debug/build/ipnet/9a9f70c67d9de840/out -L dependency=/opt/rustwide/target/x86_64-unknown-linux-gnu/debug/build/iroh-base/bd183a8669768e9d/out -L dependency=/opt/rustwide/target/x86_64-unknown-linux-gnu/debug/build/iroh-dns/9a195e41bd2ca7e9/out -L dependency=/opt/rustwide/target/x86_64-unknown-linux-gnu/debug/build/iroh-io/cb4e50a425835b1b/out -L dependency=/opt/rustwide/target/x86_64-unknown-linux-gnu/debug/build/iroh-metrics/b1d3e08bc0d47446/out -L dependency=/opt/rustwide/target/x86_64-unknown-linux-gnu/debug/build/iroh-relay/478b5b1c289710a5/out -L dependency=/opt/rustwide/target/x86_64-unknown-linux-gnu/debug/build/iroh/fa5a318d8f73b58d/out -L dependency=/opt/rustwide/target/x86_64-unknown-linux-gnu/debug/build/is_terminal_polyfill/cc67202a07d55c7a/out -L dependency=/opt/rustwide/target/x86_64-unknown-linux-gnu/debug/build/itertools/ffc5b87f59d25ca4/out -L dependency=/opt/rustwide/target/x86_64-unknown-linux-gnu/debug/build/itoa/c7dfb0c4cf55b511/out -L dependency=/opt/rustwide/target/x86_64-unknown-linux-gnu/debug/build/jsonrpsee-core/ea46a913165a9d12/out -L dependency=/opt/rustwide/target/x86_64-unknown-linux-gnu/debug/build/jsonrpsee-http-client/33ee07911095c8c6/out -L dependency=/opt/rustwide/target/x86_64-unknown-linux-gnu/debug/build/jsonrpsee-server/3cd67892f62de65a/out -L dependency=/opt/rustwide/target/x86_64-unknown-linux-gnu/debug/build/jsonrpsee-types/adbefd0b324d69e4/out -L dependency=/opt/rustwide/target/x86_64-unknown-linux-gnu/debug/build/jsonrpsee/141a54e7c33803a9/out -L dependency=/opt/rustwide/target/x86_64-unknown-linux-gnu/debug/build/k256/823ccd9a65f1c7fc/out -L dependency=/opt/rustwide/target/x86_64-unknown-linux-gnu/debug/build/keccak/0416c38f1713d4da/out -L dependency=/opt/rustwide/target/x86_64-unknown-linux-gnu/debug/build/keccak/d2f2d0ec89b6c34c/out -L dependency=/opt/rustwide/target/x86_64-unknown-linux-gnu/debug/build/libc/2eee126b2dd8b848/out -L dependency=/opt/rustwide/target/x86_64-unknown-linux-gnu/debug/build/libm/a615231ddb18d19d/out -L dependency=/opt/rustwide/target/x86_64-unknown-linux-gnu/debug/build/linux-raw-sys/56287fb4cd2f1b0a/out -L dependency=/opt/rustwide/target/x86_64-unknown-linux-gnu/debug/build/litemap/6950ecd26e84d74f/out -L dependency=/opt/rustwide/target/x86_64-unknown-linux-gnu/debug/build/lock_api/74b6d469d28e7fb8/out -L dependency=/opt/rustwide/target/x86_64-unknown-linux-gnu/debug/build/log/581a5414c584e6cc/out -L dependency=/opt/rustwide/target/x86_64-unknown-linux-gnu/debug/build/lru-slab/ee0611f3e007e89f/out -L dependency=/opt/rustwide/target/x86_64-unknown-linux-gnu/debug/build/lru/6303bd914941668c/out -L dependency=/opt/rustwide/target/x86_64-unknown-linux-gnu/debug/build/mac-addr/ea272d9190c6d711/out -L dependency=/opt/rustwide/target/x86_64-unknown-linux-gnu/debug/build/memchr/56f4b3c6fe372526/out -L dependency=/opt/rustwide/target/x86_64-unknown-linux-gnu/debug/build/mio/55c6b79677daa1e5/out -L dependency=/opt/rustwide/target/x86_64-unknown-linux-gnu/debug/build/n0-dns-resolver/74b2ab4618b0d0c6/out -L dependency=/opt/rustwide/target/x86_64-unknown-linux-gnu/debug/build/n0-error/75137c16de814a3c/out -L dependency=/opt/rustwide/target/x86_64-unknown-linux-gnu/debug/build/n0-future/3f99de3d611f1eaf/out -L dependency=/opt/rustwide/target/x86_64-unknown-linux-gnu/debug/build/n0-watcher/ac0840fa2bbc12f3/out -L dependency=/opt/rustwide/target/x86_64-unknown-linux-gnu/debug/build/netdev/b2aad86f3536a3fe/out -L dependency=/opt/rustwide/target/x86_64-unknown-linux-gnu/debug/build/netlink-packet-core/c89453f30f8c2622/out -L dependency=/opt/rustwide/target/x86_64-unknown-linux-gnu/debug/build/netlink-packet-core/cea3b31bbc1dcd98/out -L dependency=/opt/rustwide/target/x86_64-unknown-linux-gnu/debug/build/netlink-packet-route/99e7f4c29fe2032a/out -L dependency=/opt/rustwide/target/x86_64-unknown-linux-gnu/debug/build/netlink-packet-route/da959ca5a4c829e3/out -L dependency=/opt/rustwide/target/x86_64-unknown-linux-gnu/debug/build/netlink-proto/d8d725b7949b2981/out -L dependency=/opt/rustwide/target/x86_64-unknown-linux-gnu/debug/build/netlink-sys/1c6f15786e53698a/out -L dependency=/opt/rustwide/target/x86_64-unknown-linux-gnu/debug/build/netlink-sys/cd79ae984a966549/out -L dependency=/opt/rustwide/target/x86_64-unknown-linux-gnu/debug/build/netwatch/a32c7fd702c3f2aa/out -L dependency=/opt/rustwide/target/x86_64-unknown-linux-gnu/debug/build/noq-proto/d1302f3c548b97e1/out -L dependency=/opt/rustwide/target/x86_64-unknown-linux-gnu/debug/build/noq-udp/f77c6e18e56f2a59/out -L dependency=/opt/rustwide/target/x86_64-unknown-linux-gnu/debug/build/noq/a71e2eb65c3595df/out -L dependency=/opt/rustwide/target/x86_64-unknown-linux-gnu/debug/build/num-conv/31ae0e227ddb2751/out -L dependency=/opt/rustwide/target/x86_64-unknown-linux-gnu/debug/build/num_enum/311248e4a3d6cfc8/out -L dependency=/opt/rustwide/target/x86_64-unknown-linux-gnu/debug/build/nybbles/2d498bca0fd2dafe/out -L dependency=/opt/rustwide/target/x86_64-unknown-linux-gnu/debug/build/once_cell/99dfa8c2adc0e264/out -L dependency=/opt/rustwide/target/x86_64-unknown-linux-gnu/debug/build/opaque-debug/2dca9aece6027530/out -L dependency=/opt/rustwide/target/x86_64-unknown-linux-gnu/debug/build/openssl-probe/579c38e5569400ad/out -L dependency=/opt/rustwide/target/x86_64-unknown-linux-gnu/debug/build/option-ext/3023cb71f0d7a316/out -L dependency=/opt/rustwide/target/x86_64-unknown-linux-gnu/debug/build/papaya/a9a546d269bca854/out -L dependency=/opt/rustwide/target/x86_64-unknown-linux-gnu/debug/build/parking/09206e406a740ceb/out -L dependency=/opt/rustwide/target/x86_64-unknown-linux-gnu/debug/build/parking_lot/aabfa24dabd7eecf/out -L dependency=/opt/rustwide/target/x86_64-unknown-linux-gnu/debug/build/parking_lot_core/bb6987d676f8ea08/out -L dependency=/opt/rustwide/target/x86_64-unknown-linux-gnu/debug/build/pbkdf2/e6a1cdec0664d265/out -L dependency=/opt/rustwide/target/x86_64-unknown-linux-gnu/debug/build/pem-rfc7468/cfba1e45fbbf6b5f/out -L dependency=/opt/rustwide/target/x86_64-unknown-linux-gnu/debug/build/percent-encoding/8ee2a12faa4bea7c/out -L dependency=/opt/rustwide/target/x86_64-unknown-linux-gnu/debug/build/phf/7740cf6883c4b047/out -L dependency=/opt/rustwide/target/x86_64-unknown-linux-gnu/debug/build/phf_shared/790ee092484bf66a/out -L dependency=/opt/rustwide/target/x86_64-unknown-linux-gnu/debug/build/pin-project-lite/bc47108c5d8f25ae/out -L dependency=/opt/rustwide/target/x86_64-unknown-linux-gnu/debug/build/pin-project/3733ba579604a49e/out -L dependency=/opt/rustwide/target/x86_64-unknown-linux-gnu/debug/build/pkcs8/4d331d31ea934ecb/out -L dependency=/opt/rustwide/target/x86_64-unknown-linux-gnu/debug/build/polyval/f3daa79963b55c1f/out -L dependency=/opt/rustwide/target/x86_64-unknown-linux-gnu/debug/build/portable-atomic/c8c7c73150d41937/out -L dependency=/opt/rustwide/target/x86_64-unknown-linux-gnu/debug/build/portmapper/b83eae2b84e65399/out -L dependency=/opt/rustwide/target/x86_64-unknown-linux-gnu/debug/build/positioned-io/b9c32c52b41d0a2e/out -L dependency=/opt/rustwide/target/x86_64-unknown-linux-gnu/debug/build/postcard/074ef96f765b3bf8/out -L dependency=/opt/rustwide/target/x86_64-unknown-linux-gnu/debug/build/potential_utf/2a8c4ebdd5a900b1/out -L dependency=/opt/rustwide/target/x86_64-unknown-linux-gnu/debug/build/powerfmt/be1ccbb9deb5e01d/out -L dependency=/opt/rustwide/target/x86_64-unknown-linux-gnu/debug/build/ppv-lite86/555c47ae3b513429/out -L dependency=/opt/rustwide/target/x86_64-unknown-linux-gnu/debug/build/rand/31aaa9a3db0e5840/out -L dependency=/opt/rustwide/target/x86_64-unknown-linux-gnu/debug/build/rand/834932db320553d4/out -L dependency=/opt/rustwide/target/x86_64-unknown-linux-gnu/debug/build/rand/cb05d94fd300832d/out -L dependency=/opt/rustwide/target/x86_64-unknown-linux-gnu/debug/build/rand_chacha/5444c9e84e2ecf5d/out -L dependency=/opt/rustwide/target/x86_64-unknown-linux-gnu/debug/build/rand_chacha/a5edf3a7cb6f5cd2/out -L dependency=/opt/rustwide/target/x86_64-unknown-linux-gnu/debug/build/rand_core/5dd3abd9f0e58f6e/out -L dependency=/opt/rustwide/target/x86_64-unknown-linux-gnu/debug/build/rand_core/b428739067e0dffa/out -L dependency=/opt/rustwide/target/x86_64-unknown-linux-gnu/debug/build/rand_core/ff70fce9220e5cdd/out -L dependency=/opt/rustwide/target/x86_64-unknown-linux-gnu/debug/build/rand_pcg/310e45add3999900/out -L dependency=/opt/rustwide/target/x86_64-unknown-linux-gnu/debug/build/range-collections/29fd6a593c73a6c9/out -L dependency=/opt/rustwide/target/x86_64-unknown-linux-gnu/debug/build/redb/497a55fd1d5914e8/out -L dependency=/opt/rustwide/target/x86_64-unknown-linux-gnu/debug/build/ref-cast/4395c414fc3df4c7/out -L dependency=/opt/rustwide/target/x86_64-unknown-linux-gnu/debug/build/reqwest/b6e5a7d5aeaeee84/out -L dependency=/opt/rustwide/target/x86_64-unknown-linux-gnu/debug/build/rfc6979/5100e1240f2e09d4/out -L dependency=/opt/rustwide/target/x86_64-unknown-linux-gnu/debug/build/ring/cd3c2ff59f56f6fb/out -L dependency=/opt/rustwide/target/x86_64-unknown-linux-gnu/debug/build/route-recognizer/5e8e44b97ac24068/out -L dependency=/opt/rustwide/target/x86_64-unknown-linux-gnu/debug/build/rpassword/372d12bc79b88781/out -L dependency=/opt/rustwide/target/x86_64-unknown-linux-gnu/debug/build/rtoolbox/e5893fda8f3bb4c6/out -L dependency=/opt/rustwide/target/x86_64-unknown-linux-gnu/debug/build/ruint/d5163cccafc043f1/out -L dependency=/opt/rustwide/target/x86_64-unknown-linux-gnu/debug/build/rustc-hash/0c8827cc88ac4f78/out -L dependency=/opt/rustwide/target/x86_64-unknown-linux-gnu/debug/build/rustix/590cb249328e5b51/out -L dependency=/opt/rustwide/target/x86_64-unknown-linux-gnu/debug/build/rustls-native-certs/d262c3a9720b6af4/out -L dependency=/opt/rustwide/target/x86_64-unknown-linux-gnu/debug/build/rustls-pki-types/9606523609753632/out -L dependency=/opt/rustwide/target/x86_64-unknown-linux-gnu/debug/build/rustls-platform-verifier/05acefd823332545/out -L dependency=/opt/rustwide/target/x86_64-unknown-linux-gnu/debug/build/rustls-platform-verifier/cf56361fcdc46c5b/out -L dependency=/opt/rustwide/target/x86_64-unknown-linux-gnu/debug/build/rustls-webpki/106aa4b72d3dd786/out -L dependency=/opt/rustwide/target/x86_64-unknown-linux-gnu/debug/build/rustls/c0f5b1808b809be7/out -L dependency=/opt/rustwide/target/x86_64-unknown-linux-gnu/debug/build/ryu/0ab78070e7f1387c/out -L dependency=/opt/rustwide/target/x86_64-unknown-linux-gnu/debug/build/salsa20/1019935b30cf3261/out -L dependency=/opt/rustwide/target/x86_64-unknown-linux-gnu/debug/build/scopeguard/cb69a910c37095f0/out -L dependency=/opt/rustwide/target/x86_64-unknown-linux-gnu/debug/build/scrypt/05be347eae9dcf71/out -L dependency=/opt/rustwide/target/x86_64-unknown-linux-gnu/debug/build/sec1/ba92804d5df0ccd3/out -L dependency=/opt/rustwide/target/x86_64-unknown-linux-gnu/debug/build/seize/d3deef878486cc41/out -L dependency=/opt/rustwide/target/x86_64-unknown-linux-gnu/debug/build/self_cell/f386b1621cb7e4bd/out -L dependency=/opt/rustwide/target/x86_64-unknown-linux-gnu/debug/build/serde/c03e6eb3530f5a33/out -L dependency=/opt/rustwide/target/x86_64-unknown-linux-gnu/debug/build/serde_bytes/73f9074a6adaa656/out -L dependency=/opt/rustwide/target/x86_64-unknown-linux-gnu/debug/build/serde_core/fe9fd367ae2cbc2b/out -L dependency=/opt/rustwide/target/x86_64-unknown-linux-gnu/debug/build/serde_json/8cdefa99b7b54856/out -L dependency=/opt/rustwide/target/x86_64-unknown-linux-gnu/debug/build/serde_spanned/8d3144fcb2dae971/out -L dependency=/opt/rustwide/target/x86_64-unknown-linux-gnu/debug/build/serde_with/542e8cee1b042ae1/out -L dependency=/opt/rustwide/target/x86_64-unknown-linux-gnu/debug/build/serdect/43defda388f34e64/out -L dependency=/opt/rustwide/target/x86_64-unknown-linux-gnu/debug/build/sha1/f731d3e79d378bae/out -L dependency=/opt/rustwide/target/x86_64-unknown-linux-gnu/debug/build/sha1_smol/0faf3c2b9f99d3d6/out -L dependency=/opt/rustwide/target/x86_64-unknown-linux-gnu/debug/build/sha2/07a6f21e0eac1e72/out -L dependency=/opt/rustwide/target/x86_64-unknown-linux-gnu/debug/build/sha2/c03dd81875ad725b/out -L dependency=/opt/rustwide/target/x86_64-unknown-linux-gnu/debug/build/sha3/078f26a336f2a30f/out -L dependency=/opt/rustwide/target/x86_64-unknown-linux-gnu/debug/build/sha3/e1ff72ddd6ab94d2/out -L dependency=/opt/rustwide/target/x86_64-unknown-linux-gnu/debug/build/signal-hook-registry/f3c62b5d672fe1de/out -L dependency=/opt/rustwide/target/x86_64-unknown-linux-gnu/debug/build/signature/422ee31e7a71ad34/out -L dependency=/opt/rustwide/target/x86_64-unknown-linux-gnu/debug/build/signature/c523b0afe9d36f1f/out -L dependency=/opt/rustwide/target/x86_64-unknown-linux-gnu/debug/build/simdutf8/704fe1bbeec62a1f/out -L dependency=/opt/rustwide/target/x86_64-unknown-linux-gnu/debug/build/simple-dns/c5e3c4c75ccae1e7/out -L dependency=/opt/rustwide/target/x86_64-unknown-linux-gnu/debug/build/siphasher/da44cfdd0d5f891d/out -L dependency=/opt/rustwide/target/x86_64-unknown-linux-gnu/debug/build/slab/514469061b8e15e7/out -L dependency=/opt/rustwide/target/x86_64-unknown-linux-gnu/debug/build/smallvec/72ca6ed415e941d5/out -L dependency=/opt/rustwide/target/x86_64-unknown-linux-gnu/debug/build/socket2/f5f846406d4550c2/out -L dependency=/opt/rustwide/target/x86_64-unknown-linux-gnu/debug/build/soketto/f74c3bc170ce125e/out -L dependency=/opt/rustwide/target/x86_64-unknown-linux-gnu/debug/build/sorted-index-buffer/35c6627c8802c08d/out -L dependency=/opt/rustwide/target/x86_64-unknown-linux-gnu/debug/build/spin/44809ae8faf91132/out -L dependency=/opt/rustwide/target/x86_64-unknown-linux-gnu/debug/build/spin/624f3f4f573a3c83/out -L dependency=/opt/rustwide/target/x86_64-unknown-linux-gnu/debug/build/spki/0908f3a9024c0b5c/out -L dependency=/opt/rustwide/target/x86_64-unknown-linux-gnu/debug/build/spki/5295db24d4e838a7/out -L dependency=/opt/rustwide/target/x86_64-unknown-linux-gnu/debug/build/stable_deref_trait/cc29e2eb4af995bb/out -L dependency=/opt/rustwide/target/x86_64-unknown-linux-gnu/debug/build/strsim/70cae33bcd7dd7c9/out -L dependency=/opt/rustwide/target/x86_64-unknown-linux-gnu/debug/build/strum/a9467d94c4e853c9/out -L dependency=/opt/rustwide/target/x86_64-unknown-linux-gnu/debug/build/subtle/c41cb393c7692340/out -L dependency=/opt/rustwide/target/x86_64-unknown-linux-gnu/debug/build/sync_wrapper/12215b6d832316e4/out -L dependency=/opt/rustwide/target/x86_64-unknown-linux-gnu/debug/build/thiserror/1fb79108550c9261/out -L dependency=/opt/rustwide/target/x86_64-unknown-linux-gnu/debug/build/thiserror/45013b2faa3c34d3/out -L dependency=/opt/rustwide/target/x86_64-unknown-linux-gnu/debug/build/time-core/49be3c2b76f1f91d/out -L dependency=/opt/rustwide/target/x86_64-unknown-linux-gnu/debug/build/time/b256324327c46af2/out -L dependency=/opt/rustwide/target/x86_64-unknown-linux-gnu/debug/build/tinystr/0a7598718adb91cf/out -L dependency=/opt/rustwide/target/x86_64-unknown-linux-gnu/debug/build/tinyvec/65be470e6c06cde5/out -L dependency=/opt/rustwide/target/x86_64-unknown-linux-gnu/debug/build/tokio-rustls/a3346d33b2125b72/out -L dependency=/opt/rustwide/target/x86_64-unknown-linux-gnu/debug/build/tokio-stream/2fc3086064e03f0f/out -L dependency=/opt/rustwide/target/x86_64-unknown-linux-gnu/debug/build/tokio-util/78e22e7ea85f2222/out -L dependency=/opt/rustwide/target/x86_64-unknown-linux-gnu/debug/build/tokio-websockets/67ed69846200a5a2/out -L dependency=/opt/rustwide/target/x86_64-unknown-linux-gnu/debug/build/tokio/8302a3aa8eea48db/out -L dependency=/opt/rustwide/target/x86_64-unknown-linux-gnu/debug/build/toml/48b03437432136a8/out -L dependency=/opt/rustwide/target/x86_64-unknown-linux-gnu/debug/build/toml_datetime/f0144a310c101efb/out -L dependency=/opt/rustwide/target/x86_64-unknown-linux-gnu/debug/build/toml_parser/f68c5e51147c163b/out -L dependency=/opt/rustwide/target/x86_64-unknown-linux-gnu/debug/build/toml_writer/3849ac843f35c01f/out -L dependency=/opt/rustwide/target/x86_64-unknown-linux-gnu/debug/build/tower-http/8ce3123682b30f7b/out -L dependency=/opt/rustwide/target/x86_64-unknown-linux-gnu/debug/build/tower-layer/f80f0a0cfa5e2d11/out -L dependency=/opt/rustwide/target/x86_64-unknown-linux-gnu/debug/build/tower-service/415a761b7ca3059d/out -L dependency=/opt/rustwide/target/x86_64-unknown-linux-gnu/debug/build/tower/e9bea1abf3798177/out -L dependency=/opt/rustwide/target/x86_64-unknown-linux-gnu/debug/build/tracing-core/f84c62a05ff5e545/out -L dependency=/opt/rustwide/target/x86_64-unknown-linux-gnu/debug/build/tracing/3fbf82f1f46e5c4f/out -L dependency=/opt/rustwide/target/x86_64-unknown-linux-gnu/debug/build/try-lock/04e7f12c80193707/out -L dependency=/opt/rustwide/target/x86_64-unknown-linux-gnu/debug/build/typenum/2beadf215648d917/out -L dependency=/opt/rustwide/target/x86_64-unknown-linux-gnu/debug/build/universal-hash/283b0f68e221d9ce/out -L dependency=/opt/rustwide/target/x86_64-unknown-linux-gnu/debug/build/untrusted/f6c5f8f27801f358/out -L dependency=/opt/rustwide/target/x86_64-unknown-linux-gnu/debug/build/url/7f13148b7405c3c9/out -L dependency=/opt/rustwide/target/x86_64-unknown-linux-gnu/debug/build/utf8_iter/3a94834afadbc640/out -L dependency=/opt/rustwide/target/x86_64-unknown-linux-gnu/debug/build/utf8parse/d53ecf6177e2cf1f/out -L dependency=/opt/rustwide/target/x86_64-unknown-linux-gnu/debug/build/uuid/871596dfcf5786f3/out -L dependency=/opt/rustwide/target/x86_64-unknown-linux-gnu/debug/build/want/99941ac8680c0356/out -L dependency=/opt/rustwide/target/x86_64-unknown-linux-gnu/debug/build/webpki-roots/0bcc20cac5036925/out -L dependency=/opt/rustwide/target/x86_64-unknown-linux-gnu/debug/build/winnow/c47385772746fde4/out -L dependency=/opt/rustwide/target/x86_64-unknown-linux-gnu/debug/build/writeable/e05c6b00d7ca546b/out -L dependency=/opt/rustwide/target/x86_64-unknown-linux-gnu/debug/build/xml-rs/387097f123fab703/out -L dependency=/opt/rustwide/target/x86_64-unknown-linux-gnu/debug/build/xmltree/816b85526469f3f5/out -L dependency=/opt/rustwide/target/x86_64-unknown-linux-gnu/debug/build/yoke/d2509cc1e95f32d4/out -L dependency=/opt/rustwide/target/x86_64-unknown-linux-gnu/debug/build/zerocopy/a11eddca8af86160/out -L dependency=/opt/rustwide/target/x86_64-unknown-linux-gnu/debug/build/zerofrom/d45c947ba48b73b8/out -L dependency=/opt/rustwide/target/x86_64-unknown-linux-gnu/debug/build/zeroize/fd911d1827ec72ce/out -L dependency=/opt/rustwide/target/x86_64-unknown-linux-gnu/debug/build/zerotrie/179f3670d6bd2f31/out -L dependency=/opt/rustwide/target/x86_64-unknown-linux-gnu/debug/build/zerovec/4b4482606a1431c4/out -L dependency=/opt/rustwide/target/x86_64-unknown-linux-gnu/debug/build/zmij/af95491124e15c46/out -L dependency=/opt/rustwide/target/debug/build/decdn-client/5241d1863db194ad/out --extern alloy=/opt/rustwide/target/x86_64-unknown-linux-gnu/debug/build/alloy/51b2cb65b6fdfc4d/out/liballoy-51b2cb65b6fdfc4d.rmeta --extern anyhow=/opt/rustwide/target/x86_64-unknown-linux-gnu/debug/build/anyhow/dc2bfc1937e0573f/out/libanyhow-dc2bfc1937e0573f.rmeta --extern bao_tree=/opt/rustwide/target/x86_64-unknown-linux-gnu/debug/build/bao-tree/6dc29b87cb9a2e58/out/libbao_tree-6dc29b87cb9a2e58.rmeta --extern blake3=/opt/rustwide/target/x86_64-unknown-linux-gnu/debug/build/blake3/4bbca398572a43c5/out/libblake3-4bbca398572a43c5.rmeta --extern bytes=/opt/rustwide/target/x86_64-unknown-linux-gnu/debug/build/bytes/ab70f24944cb3baa/out/libbytes-ab70f24944cb3baa.rmeta --extern decdn_bao_range=/opt/rustwide/target/x86_64-unknown-linux-gnu/debug/build/decdn-bao-range/17e3fa6b91fb9713/out/libdecdn_bao_range-17e3fa6b91fb9713.rmeta --extern decdn_common=/opt/rustwide/target/x86_64-unknown-linux-gnu/debug/build/decdn-common/c1f2199947dff77a/out/libdecdn_common-c1f2199947dff77a.rmeta --extern decdn_incentive=/opt/rustwide/target/x86_64-unknown-linux-gnu/debug/build/decdn-incentive/60417a0478c8ee68/out/libdecdn_incentive-60417a0478c8ee68.rmeta --extern decdn_protocol=/opt/rustwide/target/x86_64-unknown-linux-gnu/debug/build/decdn-protocol/7e06752e9575d239/out/libdecdn_protocol-7e06752e9575d239.rmeta --extern futures_util=/opt/rustwide/target/x86_64-unknown-linux-gnu/debug/build/futures-util/b11152f7f4318d24/out/libfutures_util-b11152f7f4318d24.rmeta --extern iroh=/opt/rustwide/target/x86_64-unknown-linux-gnu/debug/build/iroh/fa5a318d8f73b58d/out/libiroh-fa5a318d8f73b58d.rmeta --extern iroh_io=/opt/rustwide/target/x86_64-unknown-linux-gnu/debug/build/iroh-io/cb4e50a425835b1b/out/libiroh_io-cb4e50a425835b1b.rmeta --extern rand=/opt/rustwide/target/x86_64-unknown-linux-gnu/debug/build/rand/cb05d94fd300832d/out/librand-cb05d94fd300832d.rmeta --extern serde=/opt/rustwide/target/x86_64-unknown-linux-gnu/debug/build/serde/c03e6eb3530f5a33/out/libserde-c03e6eb3530f5a33.rmeta --extern serde_json=/opt/rustwide/target/x86_64-unknown-linux-gnu/debug/build/serde_json/8cdefa99b7b54856/out/libserde_json-8cdefa99b7b54856.rmeta --extern tempfile=/opt/rustwide/target/x86_64-unknown-linux-gnu/debug/build/tempfile/4ca386e4f4c79f95/out/libtempfile-4ca386e4f4c79f95.rmeta --extern tokio=/opt/rustwide/target/x86_64-unknown-linux-gnu/debug/build/tokio/8302a3aa8eea48db/out/libtokio-8302a3aa8eea48db.rmeta --extern tokio_util=/opt/rustwide/target/x86_64-unknown-linux-gnu/debug/build/tokio-util/78e22e7ea85f2222/out/libtokio_util-78e22e7ea85f2222.rmeta --extern tracing=/opt/rustwide/target/x86_64-unknown-linux-gnu/debug/build/tracing/3fbf82f1f46e5c4f/out/libtracing-3fbf82f1f46e5c4f.rmeta --cap-lints allow --force-warn=unused_crate_dependencies -L native=/opt/rustwide/target/x86_64-unknown-linux-gnu/debug/build/aws-lc-sys/746269e86a3ecf3c/out -L native=/opt/rustwide/target/x86_64-unknown-linux-gnu/debug/build/ring/23d4c39807bead7f/out -L native=/opt/rustwide/target/x86_64-unknown-linux-gnu/debug/build/blake3/a8abf3c2e3bbe681/out -L native=/opt/rustwide/target/x86_64-unknown-linux-gnu/debug/build/blake3/a8abf3c2e3bbe681/out` (exit status: 101) [INFO] [stderr] warning: build failed, waiting for other jobs to finish... [INFO] [stderr] [INFO] [stderr] thread 'rustc' (7438) panicked at /rustc-dev/822182db4c4a1827256881d8c7aa685f0bcf2b11/compiler/rustc_hir_analysis/src/check/compare_impl_item.rs:2144:64: [INFO] [stderr] DefId::expect_local: `DefId(33:83 ~ iroh_io[9918]::AsyncStreamReader::read::L)` isn't local [INFO] [stderr] stack backtrace: [INFO] [stderr] 0: 0x7eb53fc1c356 - <<std[5973c7964af9b600]::sys::backtrace::BacktraceLock>::print::DisplayBacktrace as core[3b9553ef3b53823b]::fmt::Display>::fmt [INFO] [stderr] 1: 0x7eb54020f8cf - core[3b9553ef3b53823b]::fmt::write [INFO] [stderr] 2: 0x7eb53fc32a1c - <std[5973c7964af9b600]::sys::stdio::unix::Stderr as core[3b9553ef3b53823b]::io::write::Write>::write_fmt [INFO] [stderr] 3: 0x7eb53fbed3ca - std[5973c7964af9b600]::panicking::default_hook::{closure#0} [INFO] [stderr] 4: 0x7eb53fc0f8b3 - std[5973c7964af9b600]::panicking::default_hook [INFO] [stderr] 5: 0x7eb53e9ad965 - std[5973c7964af9b600]::panicking::update_hook::<alloc[121a7db9d405704b]::boxed::Box<rustc_driver_impl[642e5338f9e9821d]::install_ice_hook::{closure#1}>>::{closure#0} [INFO] [stderr] 6: 0x7eb53fc0fd52 - std[5973c7964af9b600]::panicking::panic_with_hook [INFO] [stderr] 7: 0x7eb53fbed482 - std[5973c7964af9b600]::panicking::panic_handler::{closure#0} [INFO] [stderr] 8: 0x7eb53fbe48b9 - std[5973c7964af9b600]::sys::backtrace::__rust_end_short_backtrace::<std[5973c7964af9b600]::panicking::panic_handler::{closure#0}, !> [INFO] [stderr] 9: 0x7eb53fbef1dd - __rustc[3e7819e8f9559761]::rust_begin_unwind [INFO] [stderr] 10: 0x7eb53ba440ec - core[3b9553ef3b53823b]::panicking::panic_fmt [INFO] [stderr] 11: 0x7eb5409735e9 - rustc_hir_analysis[46ea49d74bf95593]::check::compare_impl_item::compare_const_generic_param_types [INFO] [stderr] 12: 0x7eb540961649 - rustc_hir_analysis[46ea49d74bf95593]::check::compare_impl_item::compare_impl_item [INFO] [stderr] 13: 0x7eb54095ead7 - rustc_query_impl[e3932da73fb533b]::query_vtables::compare_impl_item::invoke_provider_fn::__rust_begin_short_backtrace [INFO] [stderr] 14: 0x7eb540d7d46f - rustc_query_impl[e3932da73fb533b]::execution::try_execute_query::<rustc_data_structures[c3461be0c5b51291]::vec_cache::VecCache<rustc_span[94d51ae37cfad2df]::def_id::LocalDefId, rustc_middle[50f406ae809bdc6f]::query::erase::ErasedData<[u8; 1usize]>, rustc_middle[50f406ae809bdc6f]::dep_graph::graph::DepNodeIndex>, false> [INFO] [stderr] 15: 0x7eb540d7d115 - rustc_query_impl[e3932da73fb533b]::query_vtables::compare_impl_item::execute_query_non_incr::__rust_end_short_backtrace [INFO] [stderr] 16: 0x7eb540d805e9 - rustc_hir_analysis[46ea49d74bf95593]::check::check::check_item_type [INFO] [stderr] 17: 0x7eb540d7e078 - rustc_hir_analysis[46ea49d74bf95593]::check::wfcheck::check_well_formed [INFO] [stderr] 18: 0x7eb540d7e059 - rustc_query_impl[e3932da73fb533b]::query_vtables::check_well_formed::invoke_provider_fn::__rust_begin_short_backtrace [INFO] [stderr] 19: 0x7eb540d7d46f - rustc_query_impl[e3932da73fb533b]::execution::try_execute_query::<rustc_data_structures[c3461be0c5b51291]::vec_cache::VecCache<rustc_span[94d51ae37cfad2df]::def_id::LocalDefId, rustc_middle[50f406ae809bdc6f]::query::erase::ErasedData<[u8; 1usize]>, rustc_middle[50f406ae809bdc6f]::dep_graph::graph::DepNodeIndex>, false> [INFO] [stderr] 20: 0x7eb540d7d1d5 - rustc_query_impl[e3932da73fb533b]::query_vtables::check_well_formed::execute_query_non_incr::__rust_end_short_backtrace [INFO] [stderr] 21: 0x7eb540d7aad1 - rustc_hir_analysis[46ea49d74bf95593]::check::wfcheck::check_type_wf [INFO] [stderr] 22: 0x7eb540d7a9cd - rustc_query_impl[e3932da73fb533b]::query_vtables::check_type_wf::invoke_provider_fn::__rust_begin_short_backtrace [INFO] [stderr] 23: 0x7eb54138bb04 - rustc_query_impl[e3932da73fb533b]::execution::try_execute_query::<rustc_middle[50f406ae809bdc6f]::query::caches::SingleCache<rustc_middle[50f406ae809bdc6f]::query::erase::ErasedData<[u8; 1usize]>>, false> [INFO] [stderr] 24: 0x7eb54138b8ad - rustc_query_impl[e3932da73fb533b]::query_vtables::check_type_wf::execute_query_non_incr::__rust_end_short_backtrace [INFO] [stderr] 25: 0x7eb540883a1d - rustc_hir_analysis[46ea49d74bf95593]::check_crate [INFO] [stderr] 26: 0x7eb540896579 - rustc_interface[a68ffc0296649d7b]::passes::analysis [INFO] [stderr] 27: 0x7eb54138e01f - rustc_query_impl[e3932da73fb533b]::execution::try_execute_query::<rustc_middle[50f406ae809bdc6f]::query::caches::SingleCache<rustc_middle[50f406ae809bdc6f]::query::erase::ErasedData<[u8; 0usize]>>, false> [INFO] [stderr] 28: 0x7eb54138de13 - rustc_query_impl[e3932da73fb533b]::query_vtables::analysis::execute_query_non_incr::__rust_end_short_backtrace [INFO] [stderr] 29: 0x7eb541532965 - rustc_interface[a68ffc0296649d7b]::interface::run_compiler::<(), rustc_driver_impl[642e5338f9e9821d]::compiler_entrypoint::{closure#0}>::{closure#2} [INFO] [stderr] 30: 0x7eb541560202 - std[5973c7964af9b600]::sys::backtrace::__rust_begin_short_backtrace::<rustc_interface[a68ffc0296649d7b]::util::run_in_thread_with_globals<rustc_interface[a68ffc0296649d7b]::util::run_in_thread_pool_with_globals<rustc_interface[a68ffc0296649d7b]::interface::run_compiler<(), rustc_driver_impl[642e5338f9e9821d]::compiler_entrypoint::{closure#0}>::{closure#2}, ()>::{closure#0}, ()>::{closure#0}::{closure#0}, ()> [INFO] [stderr] 31: 0x7eb54155ffad - <std[5973c7964af9b600]::thread::lifecycle::spawn_unchecked<rustc_interface[a68ffc0296649d7b]::util::run_in_thread_with_globals<rustc_interface[a68ffc0296649d7b]::util::run_in_thread_pool_with_globals<rustc_interface[a68ffc0296649d7b]::interface::run_compiler<(), rustc_driver_impl[642e5338f9e9821d]::compiler_entrypoint::{closure#0}>::{closure#2}, ()>::{closure#0}, ()>::{closure#0}::{closure#0}, ()>::{closure#1} as core[3b9553ef3b53823b]::ops::function::FnOnce<()>>::call_once::{shim:vtable#0} [INFO] [stderr] 32: 0x7eb54155b3ad - <std[5973c7964af9b600]::sys::thread::unix::Thread>::new::thread_start [INFO] [stderr] 33: 0x7eb53a682dfa - <unknown> [INFO] [stderr] 34: 0x7eb53a7165cc - <unknown> [INFO] [stderr] 35: 0x0 - <unknown> [INFO] [stderr] [INFO] [stderr] error: the compiler unexpectedly panicked. This is a bug [INFO] [stderr] [INFO] [stderr] note: we would appreciate a bug report: https://github.com/rust-lang/rust/issues/new?labels=C-bug%2C+I-ICE%2C+T-compiler&template=ice.md [INFO] [stderr] [INFO] [stderr] note: please make sure that you have updated to the latest nightly [INFO] [stderr] [INFO] [stderr] warning: the ICE couldn't be written to `/opt/rustwide/cargo-home/registry/src/index.crates.io-1949cf8c6b5b557f/iroh-blobs-0.103.1/rustc-ice-2026-10-14T14_51_25-7434.txt`: Read-only file system (os error 30) [INFO] [stderr] [INFO] [stderr] note: rustc 1.101.0-nightly (822182db4 2026-10-13) running on x86_64-unknown-linux-gnu [INFO] [stderr] [INFO] [stderr] note: compiler flags: --crate-type lib -C embed-bitcode=no -C debuginfo=2 [INFO] [stderr] [INFO] [stderr] note: some of the compiler flags provided by cargo are hidden [INFO] [stderr] [INFO] [stderr] query stack during panic: [INFO] [stderr] #0 [compare_impl_item] checking assoc item `util::stream::<impl at /opt/rustwide/cargo-home/registry/src/index.crates.io-1949cf8c6b5b557f/iroh-blobs-0.103.1/src/util/stream.rs:340:1: 340:73>::read::{anon_assoc#0}` is compatible with trait definition [INFO] [stderr] #1 [check_well_formed] checking that `util::stream::<impl at /opt/rustwide/cargo-home/registry/src/index.crates.io-1949cf8c6b5b557f/iroh-blobs-0.103.1/src/util/stream.rs:340:1: 340:73>` is well-formed [INFO] [stderr] ... and 2 other queries... use `env RUST_BACKTRACE=1` to see the full query stack [INFO] [stderr] error: could not compile `iroh-blobs` (lib) [INFO] [stderr] [INFO] [stderr] Caused by: [INFO] [stderr] process didn't exit successfully: `/opt/rustwide/rustup-home/toolchains/nightly-x86_64-unknown-linux-gnu/bin/rustc --crate-name iroh_blobs --edition=2021 /opt/rustwide/cargo-home/registry/src/index.crates.io-1949cf8c6b5b557f/iroh-blobs-0.103.1/src/lib.rs --error-format=json --json=diagnostic-rendered-ansi,artifacts,future-incompat,unused-externs-silent --crate-type lib --emit=dep-info,metadata -C embed-bitcode=no -C debuginfo=2 --cfg 'feature="default"' --cfg 'feature="fs-store"' --cfg 'feature="hide-proto-docs"' --cfg 'feature="rpc"' --check-cfg 'cfg(docsrs,test)' --check-cfg 'cfg(feature, values("default", "fs-store", "hide-proto-docs", "metrics", "rpc"))' -C metadata=b5c8da66fbbfbe4e -C extra-filename=-b36f8301b30f3430 --out-dir /opt/rustwide/target/x86_64-unknown-linux-gnu/debug/build/iroh-blobs/b36f8301b30f3430/out --target x86_64-unknown-linux-gnu -L dependency=/opt/rustwide/target/debug/build/curve25519-dalek-derive/155eac830ac387b7/out -L dependency=/opt/rustwide/target/debug/build/data-encoding-macro-internal/f1f8d38530100a35/out -L dependency=/opt/rustwide/target/debug/build/derive_more-impl/cadff2913b7c0c35/out -L dependency=/opt/rustwide/target/debug/build/displaydoc/22c212ce809178d6/out -L dependency=/opt/rustwide/target/debug/build/enum-assoc/557dcd93a5c3abb7/out -L dependency=/opt/rustwide/target/debug/build/futures-macro/7f1d7ec9a24bf6c2/out -L dependency=/opt/rustwide/target/debug/build/genawaiter-proc-macro/fd8bee133e2347e4/out -L dependency=/opt/rustwide/target/debug/build/iroh-metrics-derive/c290eb5213de683f/out -L dependency=/opt/rustwide/target/debug/build/irpc-derive/1ca8c0aa237a35a1/out -L dependency=/opt/rustwide/target/debug/build/n0-error-macros/4384deaec690be3e/out -L dependency=/opt/rustwide/target/debug/build/num_enum_derive/e302210281b298bc/out -L dependency=/opt/rustwide/target/debug/build/paste/35f047675a76880e/out -L dependency=/opt/rustwide/target/debug/build/pin-project-internal/d796bfe7368f500b/out -L dependency=/opt/rustwide/target/debug/build/postcard-derive/8ee52a45bad2625a/out -L dependency=/opt/rustwide/target/debug/build/proc-macro-hack/2e5620a2726e57c1/out -L dependency=/opt/rustwide/target/debug/build/ref-cast-impl/9e959649f8266af4/out -L dependency=/opt/rustwide/target/debug/build/rustversion/acea2b2ba54cc62b/out -L dependency=/opt/rustwide/target/debug/build/serde_derive/9007dad461fddfed/out -L dependency=/opt/rustwide/target/debug/build/spez/d92032d14cdbb4d8/out -L dependency=/opt/rustwide/target/debug/build/strum_macros/94abbb1a4623feb5/out -L dependency=/opt/rustwide/target/debug/build/thiserror-impl/6253bd2335cfa47a/out -L dependency=/opt/rustwide/target/debug/build/tokio-macros/3e6cce02bbab7760/out -L dependency=/opt/rustwide/target/debug/build/tracing-attributes/6150e7d6d12ebfe2/out -L dependency=/opt/rustwide/target/debug/build/yoke-derive/c7e15ffda042b5dd/out -L dependency=/opt/rustwide/target/debug/build/zerocopy-derive/38ce49af96a155bb/out -L dependency=/opt/rustwide/target/debug/build/zerofrom-derive/176ee5a6758cc0e9/out -L dependency=/opt/rustwide/target/debug/build/zeroize_derive/d9f97fe268fe8e39/out -L dependency=/opt/rustwide/target/debug/build/zerovec-derive/7e91ae35670fdc63/out -L dependency=/opt/rustwide/target/x86_64-unknown-linux-gnu/debug/build/aead/8667080e2a54e494/out -L dependency=/opt/rustwide/target/x86_64-unknown-linux-gnu/debug/build/aes-gcm/3719d616aeba4d2c/out -L dependency=/opt/rustwide/target/x86_64-unknown-linux-gnu/debug/build/aes/ecd6f605dc99d239/out -L dependency=/opt/rustwide/target/x86_64-unknown-linux-gnu/debug/build/arc-swap/30a9b7de34df27f0/out -L dependency=/opt/rustwide/target/x86_64-unknown-linux-gnu/debug/build/arrayvec/9f21e2a39592551c/out -L dependency=/opt/rustwide/target/x86_64-unknown-linux-gnu/debug/build/atomic-waker/1ee4dd6b35016bce/out -L dependency=/opt/rustwide/target/x86_64-unknown-linux-gnu/debug/build/attohttpc/edf2050c01b4449e/out -L dependency=/opt/rustwide/target/x86_64-unknown-linux-gnu/debug/build/aws-lc-rs/25a73ad4d0c8a834/out -L dependency=/opt/rustwide/target/x86_64-unknown-linux-gnu/debug/build/aws-lc-sys/8c7ff64fd64f16cb/out -L dependency=/opt/rustwide/target/x86_64-unknown-linux-gnu/debug/build/backon/fc354504e4bebb0e/out -L dependency=/opt/rustwide/target/x86_64-unknown-linux-gnu/debug/build/base16ct/bb852e19c5b64aaf/out -L dependency=/opt/rustwide/target/x86_64-unknown-linux-gnu/debug/build/base64/8d462520111e2cd1/out -L dependency=/opt/rustwide/target/x86_64-unknown-linux-gnu/debug/build/base64/b79286c55b8ddc46/out -L dependency=/opt/rustwide/target/x86_64-unknown-linux-gnu/debug/build/base64ct/8f4a5f50fda948fe/out -L dependency=/opt/rustwide/target/x86_64-unknown-linux-gnu/debug/build/binary-merge/b841afada2750091/out -L dependency=/opt/rustwide/target/x86_64-unknown-linux-gnu/debug/build/bitflags/6d8a34f97d43cf17/out -L dependency=/opt/rustwide/target/x86_64-unknown-linux-gnu/debug/build/blake3/4bbca398572a43c5/out -L dependency=/opt/rustwide/target/x86_64-unknown-linux-gnu/debug/build/block-buffer/3c78bc3af296ecb5/out -L dependency=/opt/rustwide/target/x86_64-unknown-linux-gnu/debug/build/byteorder/d6ea1a268a71e2df/out -L dependency=/opt/rustwide/target/x86_64-unknown-linux-gnu/debug/build/bytes/ab70f24944cb3baa/out -L dependency=/opt/rustwide/target/x86_64-unknown-linux-gnu/debug/build/cfg-if/64129bc9a783b30c/out -L dependency=/opt/rustwide/target/x86_64-unknown-linux-gnu/debug/build/chacha20/74ea5ea1f4d8cc1c/out -L dependency=/opt/rustwide/target/x86_64-unknown-linux-gnu/debug/build/cipher/4579deaf94d93ce0/out -L dependency=/opt/rustwide/target/x86_64-unknown-linux-gnu/debug/build/cipher/d9da67ad32a1aef1/out -L dependency=/opt/rustwide/target/x86_64-unknown-linux-gnu/debug/build/cmov/1350031ff0a9e2e4/out -L dependency=/opt/rustwide/target/x86_64-unknown-linux-gnu/debug/build/cobs/e6947917cbf9df27/out -L dependency=/opt/rustwide/target/x86_64-unknown-linux-gnu/debug/build/const-oid/c2523e00a8d3a2f8/out -L dependency=/opt/rustwide/target/x86_64-unknown-linux-gnu/debug/build/constant_time_eq/55dc0f72bc989d95/out -L dependency=/opt/rustwide/target/x86_64-unknown-linux-gnu/debug/build/cordyceps/03f969f1410a7908/out -L dependency=/opt/rustwide/target/x86_64-unknown-linux-gnu/debug/build/cpufeatures/1b29d03fefd94e58/out -L dependency=/opt/rustwide/target/x86_64-unknown-linux-gnu/debug/build/cpufeatures/9cedb47b9aea73c1/out -L dependency=/opt/rustwide/target/x86_64-unknown-linux-gnu/debug/build/crypto-common/64b483f4d8b653b6/out -L dependency=/opt/rustwide/target/x86_64-unknown-linux-gnu/debug/build/crypto-common/6fff261fa0a98a05/out -L dependency=/opt/rustwide/target/x86_64-unknown-linux-gnu/debug/build/ctr/5f4f4432499c2c2c/out -L dependency=/opt/rustwide/target/x86_64-unknown-linux-gnu/debug/build/ctutils/4f7e57934cf565f6/out -L dependency=/opt/rustwide/target/x86_64-unknown-linux-gnu/debug/build/curve25519-dalek/4bf34550f488f7c8/out -L dependency=/opt/rustwide/target/x86_64-unknown-linux-gnu/debug/build/data-encoding-macro/67b4cc493d8fc45b/out -L dependency=/opt/rustwide/target/x86_64-unknown-linux-gnu/debug/build/data-encoding/a04a226ffa91c805/out -L dependency=/opt/rustwide/target/x86_64-unknown-linux-gnu/debug/build/der/568d3bf3b9931e1d/out -L dependency=/opt/rustwide/target/x86_64-unknown-linux-gnu/debug/build/deranged/ffe6735ef62095e9/out -L dependency=/opt/rustwide/target/x86_64-unknown-linux-gnu/debug/build/derive_more/83777f6539cdd8b4/out -L dependency=/opt/rustwide/target/x86_64-unknown-linux-gnu/debug/build/diatomic-waker/cad97b42acae04ad/out -L dependency=/opt/rustwide/target/x86_64-unknown-linux-gnu/debug/build/digest/f626ffd59ca241ff/out -L dependency=/opt/rustwide/target/x86_64-unknown-linux-gnu/debug/build/ed25519-dalek/8362e1a468539599/out -L dependency=/opt/rustwide/target/x86_64-unknown-linux-gnu/debug/build/ed25519/c0bd6d67185aa8ce/out -L dependency=/opt/rustwide/target/x86_64-unknown-linux-gnu/debug/build/equivalent/8b1865dbc8aad91e/out -L dependency=/opt/rustwide/target/x86_64-unknown-linux-gnu/debug/build/errno/5de176a863cbc9df/out -L dependency=/opt/rustwide/target/x86_64-unknown-linux-gnu/debug/build/fastbloom/5ce235adf01ed88c/out -L dependency=/opt/rustwide/target/x86_64-unknown-linux-gnu/debug/build/fastrand/e74e88e9c3940414/out -L dependency=/opt/rustwide/target/x86_64-unknown-linux-gnu/debug/build/fnv/7d1ab06971bea2e2/out -L dependency=/opt/rustwide/target/x86_64-unknown-linux-gnu/debug/build/foldhash/b35b53f250b14695/out -L dependency=/opt/rustwide/target/x86_64-unknown-linux-gnu/debug/build/form_urlencoded/0db4b226e86524ed/out -L dependency=/opt/rustwide/target/x86_64-unknown-linux-gnu/debug/build/futures-buffered/4e0ea650822c50b3/out -L dependency=/opt/rustwide/target/x86_64-unknown-linux-gnu/debug/build/futures-channel/87aad13054c52865/out -L dependency=/opt/rustwide/target/x86_64-unknown-linux-gnu/debug/build/futures-core/7f6dd8c80ce6e5b4/out -L dependency=/opt/rustwide/target/x86_64-unknown-linux-gnu/debug/build/futures-executor/9a323e0dc2cf0afd/out -L dependency=/opt/rustwide/target/x86_64-unknown-linux-gnu/debug/build/futures-io/598c8bf06e0927c4/out -L dependency=/opt/rustwide/target/x86_64-unknown-linux-gnu/debug/build/futures-lite/b8c7fcaee839cc43/out -L dependency=/opt/rustwide/target/x86_64-unknown-linux-gnu/debug/build/futures-sink/8aa5cb0c3e6e7d04/out -L dependency=/opt/rustwide/target/x86_64-unknown-linux-gnu/debug/build/futures-task/57a6967e73f83fae/out -L dependency=/opt/rustwide/target/x86_64-unknown-linux-gnu/debug/build/futures-util/b11152f7f4318d24/out -L dependency=/opt/rustwide/target/x86_64-unknown-linux-gnu/debug/build/futures/46aa0e6d8f48c3d6/out -L dependency=/opt/rustwide/target/x86_64-unknown-linux-gnu/debug/build/genawaiter-macro/9f5116aa80aaecc3/out -L dependency=/opt/rustwide/target/x86_64-unknown-linux-gnu/debug/build/genawaiter/dd9d5252365baf27/out -L dependency=/opt/rustwide/target/x86_64-unknown-linux-gnu/debug/build/generic-array/4f106d5832c4c16b/out -L dependency=/opt/rustwide/target/x86_64-unknown-linux-gnu/debug/build/getrandom/3b705ec22bc94c95/out -L dependency=/opt/rustwide/target/x86_64-unknown-linux-gnu/debug/build/getrandom/743537f187a6d7e8/out -L dependency=/opt/rustwide/target/x86_64-unknown-linux-gnu/debug/build/ghash/4f1afccd689fe136/out -L dependency=/opt/rustwide/target/x86_64-unknown-linux-gnu/debug/build/h2/75abb744fb960cde/out -L dependency=/opt/rustwide/target/x86_64-unknown-linux-gnu/debug/build/hash32/bb1cc7afe26e53c6/out -L dependency=/opt/rustwide/target/x86_64-unknown-linux-gnu/debug/build/hashbrown/9f806b02e1f3dbed/out -L dependency=/opt/rustwide/target/x86_64-unknown-linux-gnu/debug/build/heapless/d4c5dea1e317951e/out -L dependency=/opt/rustwide/target/x86_64-unknown-linux-gnu/debug/build/http-body-util/c1638f01ec384ba2/out -L dependency=/opt/rustwide/target/x86_64-unknown-linux-gnu/debug/build/http-body/973af3feb98514e8/out -L dependency=/opt/rustwide/target/x86_64-unknown-linux-gnu/debug/build/http/728321c908c7a3b3/out -L dependency=/opt/rustwide/target/x86_64-unknown-linux-gnu/debug/build/httparse/6c5802cd412b1799/out -L dependency=/opt/rustwide/target/x86_64-unknown-linux-gnu/debug/build/httpdate/48501241ba6d0f9e/out -L dependency=/opt/rustwide/target/x86_64-unknown-linux-gnu/debug/build/hybrid-array/ab5b2357a054c384/out -L dependency=/opt/rustwide/target/x86_64-unknown-linux-gnu/debug/build/hyper-rustls/390fa9170a945989/out -L dependency=/opt/rustwide/target/x86_64-unknown-linux-gnu/debug/build/hyper-util/def490df7d0fd47f/out -L dependency=/opt/rustwide/target/x86_64-unknown-linux-gnu/debug/build/hyper/b42f731ebce002d3/out -L dependency=/opt/rustwide/target/x86_64-unknown-linux-gnu/debug/build/iana-time-zone/7d179f524c36002b/out -L dependency=/opt/rustwide/target/x86_64-unknown-linux-gnu/debug/build/icu_collections/75cf890a1a478e47/out -L dependency=/opt/rustwide/target/x86_64-unknown-linux-gnu/debug/build/icu_locale_core/2bc3994d5d4f4fd1/out -L dependency=/opt/rustwide/target/x86_64-unknown-linux-gnu/debug/build/icu_normalizer/ad0ad92dfaf450c8/out -L dependency=/opt/rustwide/target/x86_64-unknown-linux-gnu/debug/build/icu_normalizer_data/de33df044702a225/out -L dependency=/opt/rustwide/target/x86_64-unknown-linux-gnu/debug/build/icu_properties/1efbd2a4a4db4342/out -L dependency=/opt/rustwide/target/x86_64-unknown-linux-gnu/debug/build/icu_properties_data/7dac26fb7a566c04/out -L dependency=/opt/rustwide/target/x86_64-unknown-linux-gnu/debug/build/icu_provider/b97d18d78033e0e5/out -L dependency=/opt/rustwide/target/x86_64-unknown-linux-gnu/debug/build/identity-hash/73e6f9d05086cfdc/out -L dependency=/opt/rustwide/target/x86_64-unknown-linux-gnu/debug/build/idna/fc49f558b868d664/out -L dependency=/opt/rustwide/target/x86_64-unknown-linux-gnu/debug/build/idna_adapter/e198a23892ac4e69/out -L dependency=/opt/rustwide/target/x86_64-unknown-linux-gnu/debug/build/igd-next/cd555f290289abab/out -L dependency=/opt/rustwide/target/x86_64-unknown-linux-gnu/debug/build/indexmap/259764cd554cc8c0/out -L dependency=/opt/rustwide/target/x86_64-unknown-linux-gnu/debug/build/inout/2aedaf9b92686295/out -L dependency=/opt/rustwide/target/x86_64-unknown-linux-gnu/debug/build/inout/f5544dcca26c4580/out -L dependency=/opt/rustwide/target/x86_64-unknown-linux-gnu/debug/build/inplace-vec-builder/cf00a02576f7af81/out -L dependency=/opt/rustwide/target/x86_64-unknown-linux-gnu/debug/build/ipnet/9a9f70c67d9de840/out -L dependency=/opt/rustwide/target/x86_64-unknown-linux-gnu/debug/build/iroh-base/bd183a8669768e9d/out -L dependency=/opt/rustwide/target/x86_64-unknown-linux-gnu/debug/build/iroh-dns/9a195e41bd2ca7e9/out -L dependency=/opt/rustwide/target/x86_64-unknown-linux-gnu/debug/build/iroh-io/cb4e50a425835b1b/out -L dependency=/opt/rustwide/target/x86_64-unknown-linux-gnu/debug/build/iroh-metrics/b1d3e08bc0d47446/out -L dependency=/opt/rustwide/target/x86_64-unknown-linux-gnu/debug/build/iroh-relay/478b5b1c289710a5/out -L dependency=/opt/rustwide/target/x86_64-unknown-linux-gnu/debug/build/iroh/fa5a318d8f73b58d/out -L dependency=/opt/rustwide/target/x86_64-unknown-linux-gnu/debug/build/itoa/c7dfb0c4cf55b511/out -L dependency=/opt/rustwide/target/x86_64-unknown-linux-gnu/debug/build/libc/2eee126b2dd8b848/out -L dependency=/opt/rustwide/target/x86_64-unknown-linux-gnu/debug/build/libm/a615231ddb18d19d/out -L dependency=/opt/rustwide/target/x86_64-unknown-linux-gnu/debug/build/linux-raw-sys/56287fb4cd2f1b0a/out -L dependency=/opt/rustwide/target/x86_64-unknown-linux-gnu/debug/build/litemap/6950ecd26e84d74f/out -L dependency=/opt/rustwide/target/x86_64-unknown-linux-gnu/debug/build/lock_api/74b6d469d28e7fb8/out -L dependency=/opt/rustwide/target/x86_64-unknown-linux-gnu/debug/build/log/581a5414c584e6cc/out -L dependency=/opt/rustwide/target/x86_64-unknown-linux-gnu/debug/build/lru-slab/ee0611f3e007e89f/out -L dependency=/opt/rustwide/target/x86_64-unknown-linux-gnu/debug/build/lru/6303bd914941668c/out -L dependency=/opt/rustwide/target/x86_64-unknown-linux-gnu/debug/build/mac-addr/ea272d9190c6d711/out -L dependency=/opt/rustwide/target/x86_64-unknown-linux-gnu/debug/build/memchr/56f4b3c6fe372526/out -L dependency=/opt/rustwide/target/x86_64-unknown-linux-gnu/debug/build/mio/55c6b79677daa1e5/out -L dependency=/opt/rustwide/target/x86_64-unknown-linux-gnu/debug/build/n0-dns-resolver/74b2ab4618b0d0c6/out -L dependency=/opt/rustwide/target/x86_64-unknown-linux-gnu/debug/build/n0-error/75137c16de814a3c/out -L dependency=/opt/rustwide/target/x86_64-unknown-linux-gnu/debug/build/n0-future/3f99de3d611f1eaf/out -L dependency=/opt/rustwide/target/x86_64-unknown-linux-gnu/debug/build/n0-watcher/ac0840fa2bbc12f3/out -L dependency=/opt/rustwide/target/x86_64-unknown-linux-gnu/debug/build/netdev/b2aad86f3536a3fe/out -L dependency=/opt/rustwide/target/x86_64-unknown-linux-gnu/debug/build/netlink-packet-core/c89453f30f8c2622/out -L dependency=/opt/rustwide/target/x86_64-unknown-linux-gnu/debug/build/netlink-packet-core/cea3b31bbc1dcd98/out -L dependency=/opt/rustwide/target/x86_64-unknown-linux-gnu/debug/build/netlink-packet-route/99e7f4c29fe2032a/out -L dependency=/opt/rustwide/target/x86_64-unknown-linux-gnu/debug/build/netlink-packet-route/da959ca5a4c829e3/out -L dependency=/opt/rustwide/target/x86_64-unknown-linux-gnu/debug/build/netlink-proto/d8d725b7949b2981/out -L dependency=/opt/rustwide/target/x86_64-unknown-linux-gnu/debug/build/netlink-sys/1c6f15786e53698a/out -L dependency=/opt/rustwide/target/x86_64-unknown-linux-gnu/debug/build/netlink-sys/cd79ae984a966549/out -L dependency=/opt/rustwide/target/x86_64-unknown-linux-gnu/debug/build/netwatch/a32c7fd702c3f2aa/out -L dependency=/opt/rustwide/target/x86_64-unknown-linux-gnu/debug/build/noq-proto/d1302f3c548b97e1/out -L dependency=/opt/rustwide/target/x86_64-unknown-linux-gnu/debug/build/noq-udp/f77c6e18e56f2a59/out -L dependency=/opt/rustwide/target/x86_64-unknown-linux-gnu/debug/build/noq/a71e2eb65c3595df/out -L dependency=/opt/rustwide/target/x86_64-unknown-linux-gnu/debug/build/num-conv/31ae0e227ddb2751/out -L dependency=/opt/rustwide/target/x86_64-unknown-linux-gnu/debug/build/num-traits/2314b30ae716ddb8/out -L dependency=/opt/rustwide/target/x86_64-unknown-linux-gnu/debug/build/num_enum/311248e4a3d6cfc8/out -L dependency=/opt/rustwide/target/x86_64-unknown-linux-gnu/debug/build/once_cell/99dfa8c2adc0e264/out -L dependency=/opt/rustwide/target/x86_64-unknown-linux-gnu/debug/build/opaque-debug/2dca9aece6027530/out -L dependency=/opt/rustwide/target/x86_64-unknown-linux-gnu/debug/build/openssl-probe/579c38e5569400ad/out -L dependency=/opt/rustwide/target/x86_64-unknown-linux-gnu/debug/build/papaya/a9a546d269bca854/out -L dependency=/opt/rustwide/target/x86_64-unknown-linux-gnu/debug/build/parking/09206e406a740ceb/out -L dependency=/opt/rustwide/target/x86_64-unknown-linux-gnu/debug/build/parking_lot/aabfa24dabd7eecf/out -L dependency=/opt/rustwide/target/x86_64-unknown-linux-gnu/debug/build/parking_lot_core/bb6987d676f8ea08/out -L dependency=/opt/rustwide/target/x86_64-unknown-linux-gnu/debug/build/pem-rfc7468/cfba1e45fbbf6b5f/out -L dependency=/opt/rustwide/target/x86_64-unknown-linux-gnu/debug/build/pem/b7c19774900f8af1/out -L dependency=/opt/rustwide/target/x86_64-unknown-linux-gnu/debug/build/percent-encoding/8ee2a12faa4bea7c/out -L dependency=/opt/rustwide/target/x86_64-unknown-linux-gnu/debug/build/pin-project-lite/bc47108c5d8f25ae/out -L dependency=/opt/rustwide/target/x86_64-unknown-linux-gnu/debug/build/pin-project/3733ba579604a49e/out -L dependency=/opt/rustwide/target/x86_64-unknown-linux-gnu/debug/build/pkcs8/4d331d31ea934ecb/out -L dependency=/opt/rustwide/target/x86_64-unknown-linux-gnu/debug/build/polyval/f3daa79963b55c1f/out -L dependency=/opt/rustwide/target/x86_64-unknown-linux-gnu/debug/build/portable-atomic/c8c7c73150d41937/out -L dependency=/opt/rustwide/target/x86_64-unknown-linux-gnu/debug/build/portmapper/b83eae2b84e65399/out -L dependency=/opt/rustwide/target/x86_64-unknown-linux-gnu/debug/build/positioned-io/b9c32c52b41d0a2e/out -L dependency=/opt/rustwide/target/x86_64-unknown-linux-gnu/debug/build/postcard/074ef96f765b3bf8/out -L dependency=/opt/rustwide/target/x86_64-unknown-linux-gnu/debug/build/potential_utf/2a8c4ebdd5a900b1/out -L dependency=/opt/rustwide/target/x86_64-unknown-linux-gnu/debug/build/powerfmt/be1ccbb9deb5e01d/out -L dependency=/opt/rustwide/target/x86_64-unknown-linux-gnu/debug/build/rand/cb05d94fd300832d/out -L dependency=/opt/rustwide/target/x86_64-unknown-linux-gnu/debug/build/rand_core/b428739067e0dffa/out -L dependency=/opt/rustwide/target/x86_64-unknown-linux-gnu/debug/build/rand_pcg/310e45add3999900/out -L dependency=/opt/rustwide/target/x86_64-unknown-linux-gnu/debug/build/range-collections/29fd6a593c73a6c9/out -L dependency=/opt/rustwide/target/x86_64-unknown-linux-gnu/debug/build/rcgen/a0a0ff8b925e06b3/out -L dependency=/opt/rustwide/target/x86_64-unknown-linux-gnu/debug/build/ref-cast/4395c414fc3df4c7/out -L dependency=/opt/rustwide/target/x86_64-unknown-linux-gnu/debug/build/reqwest/b6e5a7d5aeaeee84/out -L dependency=/opt/rustwide/target/x86_64-unknown-linux-gnu/debug/build/ring/cd3c2ff59f56f6fb/out -L dependency=/opt/rustwide/target/x86_64-unknown-linux-gnu/debug/build/rustc-hash/0c8827cc88ac4f78/out -L dependency=/opt/rustwide/target/x86_64-unknown-linux-gnu/debug/build/rustix/590cb249328e5b51/out -L dependency=/opt/rustwide/target/x86_64-unknown-linux-gnu/debug/build/rustls-native-certs/d262c3a9720b6af4/out -L dependency=/opt/rustwide/target/x86_64-unknown-linux-gnu/debug/build/rustls-pki-types/9606523609753632/out -L dependency=/opt/rustwide/target/x86_64-unknown-linux-gnu/debug/build/rustls-platform-verifier/05acefd823332545/out -L dependency=/opt/rustwide/target/x86_64-unknown-linux-gnu/debug/build/rustls-webpki/106aa4b72d3dd786/out -L dependency=/opt/rustwide/target/x86_64-unknown-linux-gnu/debug/build/rustls/c0f5b1808b809be7/out -L dependency=/opt/rustwide/target/x86_64-unknown-linux-gnu/debug/build/ryu/0ab78070e7f1387c/out -L dependency=/opt/rustwide/target/x86_64-unknown-linux-gnu/debug/build/scopeguard/cb69a910c37095f0/out -L dependency=/opt/rustwide/target/x86_64-unknown-linux-gnu/debug/build/seize/d3deef878486cc41/out -L dependency=/opt/rustwide/target/x86_64-unknown-linux-gnu/debug/build/self_cell/f386b1621cb7e4bd/out -L dependency=/opt/rustwide/target/x86_64-unknown-linux-gnu/debug/build/serde/c03e6eb3530f5a33/out -L dependency=/opt/rustwide/target/x86_64-unknown-linux-gnu/debug/build/serde_bytes/73f9074a6adaa656/out -L dependency=/opt/rustwide/target/x86_64-unknown-linux-gnu/debug/build/serde_core/fe9fd367ae2cbc2b/out -L dependency=/opt/rustwide/target/x86_64-unknown-linux-gnu/debug/build/serde_json/8cdefa99b7b54856/out -L dependency=/opt/rustwide/target/x86_64-unknown-linux-gnu/debug/build/serdect/43defda388f34e64/out -L dependency=/opt/rustwide/target/x86_64-unknown-linux-gnu/debug/build/sha1_smol/0faf3c2b9f99d3d6/out -L dependency=/opt/rustwide/target/x86_64-unknown-linux-gnu/debug/build/sha2/07a6f21e0eac1e72/out -L dependency=/opt/rustwide/target/x86_64-unknown-linux-gnu/debug/build/signal-hook-registry/f3c62b5d672fe1de/out -L dependency=/opt/rustwide/target/x86_64-unknown-linux-gnu/debug/build/signature/422ee31e7a71ad34/out -L dependency=/opt/rustwide/target/x86_64-unknown-linux-gnu/debug/build/simdutf8/704fe1bbeec62a1f/out -L dependency=/opt/rustwide/target/x86_64-unknown-linux-gnu/debug/build/simple-dns/c5e3c4c75ccae1e7/out -L dependency=/opt/rustwide/target/x86_64-unknown-linux-gnu/debug/build/siphasher/da44cfdd0d5f891d/out -L dependency=/opt/rustwide/target/x86_64-unknown-linux-gnu/debug/build/slab/514469061b8e15e7/out -L dependency=/opt/rustwide/target/x86_64-unknown-linux-gnu/debug/build/smallvec/72ca6ed415e941d5/out -L dependency=/opt/rustwide/target/x86_64-unknown-linux-gnu/debug/build/socket2/f5f846406d4550c2/out -L dependency=/opt/rustwide/target/x86_64-unknown-linux-gnu/debug/build/sorted-index-buffer/35c6627c8802c08d/out -L dependency=/opt/rustwide/target/x86_64-unknown-linux-gnu/debug/build/spin/44809ae8faf91132/out -L dependency=/opt/rustwide/target/x86_64-unknown-linux-gnu/debug/build/spin/624f3f4f573a3c83/out -L dependency=/opt/rustwide/target/x86_64-unknown-linux-gnu/debug/build/spki/5295db24d4e838a7/out -L dependency=/opt/rustwide/target/x86_64-unknown-linux-gnu/debug/build/stable_deref_trait/cc29e2eb4af995bb/out -L dependency=/opt/rustwide/target/x86_64-unknown-linux-gnu/debug/build/strum/a9467d94c4e853c9/out -L dependency=/opt/rustwide/target/x86_64-unknown-linux-gnu/debug/build/subtle/c41cb393c7692340/out -L dependency=/opt/rustwide/target/x86_64-unknown-linux-gnu/debug/build/sync_wrapper/12215b6d832316e4/out -L dependency=/opt/rustwide/target/x86_64-unknown-linux-gnu/debug/build/thiserror/1fb79108550c9261/out -L dependency=/opt/rustwide/target/x86_64-unknown-linux-gnu/debug/build/time-core/49be3c2b76f1f91d/out -L dependency=/opt/rustwide/target/x86_64-unknown-linux-gnu/debug/build/time/b256324327c46af2/out -L dependency=/opt/rustwide/target/x86_64-unknown-linux-gnu/debug/build/tinystr/0a7598718adb91cf/out -L dependency=/opt/rustwide/target/x86_64-unknown-linux-gnu/debug/build/tinyvec/65be470e6c06cde5/out -L dependency=/opt/rustwide/target/x86_64-unknown-linux-gnu/debug/build/tokio-rustls/a3346d33b2125b72/out -L dependency=/opt/rustwide/target/x86_64-unknown-linux-gnu/debug/build/tokio-stream/2fc3086064e03f0f/out -L dependency=/opt/rustwide/target/x86_64-unknown-linux-gnu/debug/build/tokio-util/78e22e7ea85f2222/out -L dependency=/opt/rustwide/target/x86_64-unknown-linux-gnu/debug/build/tokio-websockets/67ed69846200a5a2/out -L dependency=/opt/rustwide/target/x86_64-unknown-linux-gnu/debug/build/tokio/8302a3aa8eea48db/out -L dependency=/opt/rustwide/target/x86_64-unknown-linux-gnu/debug/build/tower-http/8ce3123682b30f7b/out -L dependency=/opt/rustwide/target/x86_64-unknown-linux-gnu/debug/build/tower-layer/f80f0a0cfa5e2d11/out -L dependency=/opt/rustwide/target/x86_64-unknown-linux-gnu/debug/build/tower-service/415a761b7ca3059d/out -L dependency=/opt/rustwide/target/x86_64-unknown-linux-gnu/debug/build/tower/e9bea1abf3798177/out -L dependency=/opt/rustwide/target/x86_64-unknown-linux-gnu/debug/build/tracing-core/f84c62a05ff5e545/out -L dependency=/opt/rustwide/target/x86_64-unknown-linux-gnu/debug/build/tracing/3fbf82f1f46e5c4f/out -L dependency=/opt/rustwide/target/x86_64-unknown-linux-gnu/debug/build/try-lock/04e7f12c80193707/out -L dependency=/opt/rustwide/target/x86_64-unknown-linux-gnu/debug/build/typenum/2beadf215648d917/out -L dependency=/opt/rustwide/target/x86_64-unknown-linux-gnu/debug/build/universal-hash/283b0f68e221d9ce/out -L dependency=/opt/rustwide/target/x86_64-unknown-linux-gnu/debug/build/untrusted/f6c5f8f27801f358/out -L dependency=/opt/rustwide/target/x86_64-unknown-linux-gnu/debug/build/url/7f13148b7405c3c9/out -L dependency=/opt/rustwide/target/x86_64-unknown-linux-gnu/debug/build/utf8_iter/3a94834afadbc640/out -L dependency=/opt/rustwide/target/x86_64-unknown-linux-gnu/debug/build/want/99941ac8680c0356/out -L dependency=/opt/rustwide/target/x86_64-unknown-linux-gnu/debug/build/webpki-roots/0bcc20cac5036925/out -L dependency=/opt/rustwide/target/x86_64-unknown-linux-gnu/debug/build/writeable/e05c6b00d7ca546b/out -L dependency=/opt/rustwide/target/x86_64-unknown-linux-gnu/debug/build/xml-rs/387097f123fab703/out -L dependency=/opt/rustwide/target/x86_64-unknown-linux-gnu/debug/build/xmltree/816b85526469f3f5/out -L dependency=/opt/rustwide/target/x86_64-unknown-linux-gnu/debug/build/yasna/1a27a452beb3f93c/out -L dependency=/opt/rustwide/target/x86_64-unknown-linux-gnu/debug/build/yoke/d2509cc1e95f32d4/out -L dependency=/opt/rustwide/target/x86_64-unknown-linux-gnu/debug/build/zerocopy/a11eddca8af86160/out -L dependency=/opt/rustwide/target/x86_64-unknown-linux-gnu/debug/build/zerofrom/d45c947ba48b73b8/out -L dependency=/opt/rustwide/target/x86_64-unknown-linux-gnu/debug/build/zeroize/fd911d1827ec72ce/out -L dependency=/opt/rustwide/target/x86_64-unknown-linux-gnu/debug/build/zerotrie/179f3670d6bd2f31/out -L dependency=/opt/rustwide/target/x86_64-unknown-linux-gnu/debug/build/zerovec/4b4482606a1431c4/out -L dependency=/opt/rustwide/target/x86_64-unknown-linux-gnu/debug/build/zmij/af95491124e15c46/out -L dependency=/opt/rustwide/target/debug/build/iroh-blobs/b36f8301b30f3430/out --extern arrayvec=/opt/rustwide/target/x86_64-unknown-linux-gnu/debug/build/arrayvec/9f21e2a39592551c/out/libarrayvec-9f21e2a39592551c.rmeta --extern bao_tree=/opt/rustwide/target/x86_64-unknown-linux-gnu/debug/build/bao-tree/6dc29b87cb9a2e58/out/libbao_tree-6dc29b87cb9a2e58.rmeta --extern bytes=/opt/rustwide/target/x86_64-unknown-linux-gnu/debug/build/bytes/ab70f24944cb3baa/out/libbytes-ab70f24944cb3baa.rmeta --extern chrono=/opt/rustwide/target/x86_64-unknown-linux-gnu/debug/build/chrono/0e002a9f204c20be/out/libchrono-0e002a9f204c20be.rmeta --extern constant_time_eq=/opt/rustwide/target/x86_64-unknown-linux-gnu/debug/build/constant_time_eq/55dc0f72bc989d95/out/libconstant_time_eq-55dc0f72bc989d95.rmeta --extern data_encoding=/opt/rustwide/target/x86_64-unknown-linux-gnu/debug/build/data-encoding/a04a226ffa91c805/out/libdata_encoding-a04a226ffa91c805.rmeta --extern derive_more=/opt/rustwide/target/x86_64-unknown-linux-gnu/debug/build/derive_more/83777f6539cdd8b4/out/libderive_more-83777f6539cdd8b4.rmeta --extern genawaiter=/opt/rustwide/target/x86_64-unknown-linux-gnu/debug/build/genawaiter/dd9d5252365baf27/out/libgenawaiter-dd9d5252365baf27.rmeta --extern hex=/opt/rustwide/target/x86_64-unknown-linux-gnu/debug/build/hex/44f3b3add99d6f16/out/libhex-44f3b3add99d6f16.rmeta --extern iroh=/opt/rustwide/target/x86_64-unknown-linux-gnu/debug/build/iroh/fa5a318d8f73b58d/out/libiroh-fa5a318d8f73b58d.rmeta --extern iroh_base=/opt/rustwide/target/x86_64-unknown-linux-gnu/debug/build/iroh-base/bd183a8669768e9d/out/libiroh_base-bd183a8669768e9d.rmeta --extern iroh_io=/opt/rustwide/target/x86_64-unknown-linux-gnu/debug/build/iroh-io/cb4e50a425835b1b/out/libiroh_io-cb4e50a425835b1b.rmeta --extern iroh_metrics=/opt/rustwide/target/x86_64-unknown-linux-gnu/debug/build/iroh-metrics/b1d3e08bc0d47446/out/libiroh_metrics-b1d3e08bc0d47446.rmeta --extern iroh_tickets=/opt/rustwide/target/x86_64-unknown-linux-gnu/debug/build/iroh-tickets/a4ac68324020952b/out/libiroh_tickets-a4ac68324020952b.rmeta --extern iroh_util=/opt/rustwide/target/x86_64-unknown-linux-gnu/debug/build/iroh-util/6ebbcb967d944214/out/libiroh_util-6ebbcb967d944214.rmeta --extern irpc=/opt/rustwide/target/x86_64-unknown-linux-gnu/debug/build/irpc/c65f4e6539cac8ed/out/libirpc-c65f4e6539cac8ed.rmeta --extern n0_error=/opt/rustwide/target/x86_64-unknown-linux-gnu/debug/build/n0-error/75137c16de814a3c/out/libn0_error-75137c16de814a3c.rmeta --extern n0_future=/opt/rustwide/target/x86_64-unknown-linux-gnu/debug/build/n0-future/3f99de3d611f1eaf/out/libn0_future-3f99de3d611f1eaf.rmeta --extern nested_enum_utils=/opt/rustwide/target/debug/build/nested_enum_utils/93a4e3660c129b83/out/libnested_enum_utils-93a4e3660c129b83.so --extern noq=/opt/rustwide/target/x86_64-unknown-linux-gnu/debug/build/noq/a71e2eb65c3595df/out/libnoq-a71e2eb65c3595df.rmeta --extern postcard=/opt/rustwide/target/x86_64-unknown-linux-gnu/debug/build/postcard/074ef96f765b3bf8/out/libpostcard-074ef96f765b3bf8.rmeta --extern rand=/opt/rustwide/target/x86_64-unknown-linux-gnu/debug/build/rand/cb05d94fd300832d/out/librand-cb05d94fd300832d.rmeta --extern range_collections=/opt/rustwide/target/x86_64-unknown-linux-gnu/debug/build/range-collections/29fd6a593c73a6c9/out/librange_collections-29fd6a593c73a6c9.rmeta --extern redb=/opt/rustwide/target/x86_64-unknown-linux-gnu/debug/build/redb/497a55fd1d5914e8/out/libredb-497a55fd1d5914e8.rmeta --extern ref_cast=/opt/rustwide/target/x86_64-unknown-linux-gnu/debug/build/ref-cast/4395c414fc3df4c7/out/libref_cast-4395c414fc3df4c7.rmeta --extern reflink_copy=/opt/rustwide/target/x86_64-unknown-linux-gnu/debug/build/reflink-copy/8fba11dcef0bfb51/out/libreflink_copy-8fba11dcef0bfb51.rmeta --extern self_cell=/opt/rustwide/target/x86_64-unknown-linux-gnu/debug/build/self_cell/f386b1621cb7e4bd/out/libself_cell-f386b1621cb7e4bd.rmeta --extern serde=/opt/rustwide/target/x86_64-unknown-linux-gnu/debug/build/serde/c03e6eb3530f5a33/out/libserde-c03e6eb3530f5a33.rmeta --extern smallvec=/opt/rustwide/target/x86_64-unknown-linux-gnu/debug/build/smallvec/72ca6ed415e941d5/out/libsmallvec-72ca6ed415e941d5.rmeta --extern tokio=/opt/rustwide/target/x86_64-unknown-linux-gnu/debug/build/tokio/8302a3aa8eea48db/out/libtokio-8302a3aa8eea48db.rmeta --extern tracing=/opt/rustwide/target/x86_64-unknown-linux-gnu/debug/build/tracing/3fbf82f1f46e5c4f/out/libtracing-3fbf82f1f46e5c4f.rmeta --cap-lints allow --force-warn=unused_crate_dependencies -L native=/opt/rustwide/target/x86_64-unknown-linux-gnu/debug/build/blake3/a8abf3c2e3bbe681/out -L native=/opt/rustwide/target/x86_64-unknown-linux-gnu/debug/build/blake3/a8abf3c2e3bbe681/out -L native=/opt/rustwide/target/x86_64-unknown-linux-gnu/debug/build/aws-lc-sys/746269e86a3ecf3c/out -L native=/opt/rustwide/target/x86_64-unknown-linux-gnu/debug/build/ring/23d4c39807bead7f/out --check-cfg 'cfg(wasm_browser)'` (exit status: 101) [INFO] running `"docker" "inspect" "2da1590c192d04f5426cff74567f82a0611a00f7048dcafdbd4088f6441577c6"`