Build failed. If you want to re-trigger a documentation build, you can do it here. You can find more information on docs.rs builds documentation on the builds page.
# error kind ExecutionFailed
# pre-build errors command failed: exit status: 101
# rustc version rustc 1.101.0-nightly (6f5da406b 2026-10-10)
# docs.rs version docsrs 0.0.0 (345207b5bd3e08551abe806ac963257c692997f6 2026-10-08 )
# build log [INFO] adding target x86_64-unknown-linux-gnu for toolchain nightly [INFO] running `"rustup" "target" "add" "--toolchain" "nightly" "x86_64-unknown-linux-gnu"` [INFO] [stderr] info: component rust-std is up to date [INFO] running `"docker" "exec" "-e" "SOURCE_DIR=/opt/rustwide/workdir" "-e" "CARGO_HOME=/opt/rustwide/cargo-home" "-e" "RUSTUP_HOME=/opt/rustwide/rustup-home" "-e" "CARGO_TARGET_DIR=/opt/rustwide/target" "-e" "DOCS_RS=1" "-w" "/opt/rustwide/workdir" "--user" "1001:1001" "96b60c52d4cd1a2c5a637e1e92af959acf0dbf3ae27bbeb5448b63392ebcab88" "/opt/rustwide/cargo-home/bin/cargo" "+nightly" "rustdoc" "--lib" "-Zrustdoc-map" "--config" "build.rustdocflags=[\"--cfg\", \"docsrs\", \"-Z\", \"unstable-options\", \"--emit=html-non-static-files\", \"--resource-suffix\", \"-20261010-1.101.0-nightly-6f5da406b\", \"--static-root-path\", \"/-/rustdoc.static/\", \"--extern-html-root-takes-precedence\"]" "--offline" "-Zunstable-options" "--config=doc.extern-map.registries.crates-io=\"https://docs.rs/{pkg_name}/{version}/x86_64-unknown-linux-gnu\"" "-j12" "--target" "x86_64-unknown-linux-gnu" "-Zrustdoc-scrape-examples"` [INFO] [stderr] warning: target filter specified, but no targets matched; this is a no-op [INFO] [stderr] Checking iroh-blobs v0.103.1 [INFO] [stderr] Checking decdn-client v0.0.3 [INFO] [stderr] [INFO] [stderr] thread 'rustc' (12023) panicked at /rustc-dev/6f5da406b56c2db6607202b63daee73aa8c61297/compiler/rustc_hir_analysis/src/check/compare_impl_item.rs:2144:64: [INFO] [stderr] DefId::expect_local: `DefId(401:83 ~ iroh_io[6a9a]::AsyncStreamReader::read::L)` isn't local [INFO] [stderr] stack backtrace: [INFO] [stderr] 0: 0x7fec44a114b6 - <<std[57438abbadb2e169]::sys::backtrace::BacktraceLock>::print::DisplayBacktrace as core[782a08e82d10715a]::fmt::Display>::fmt [INFO] [stderr] 1: 0x7fec45006ddf - core[782a08e82d10715a]::fmt::write [INFO] [stderr] 2: 0x7fec44a27a9c - <std[57438abbadb2e169]::sys::stdio::unix::Stderr as core[782a08e82d10715a]::io::write::Write>::write_fmt [INFO] [stderr] 3: 0x7fec449e276a - std[57438abbadb2e169]::panicking::default_hook::{closure#0} [INFO] [stderr] 4: 0x7fec44a04ce3 - std[57438abbadb2e169]::panicking::default_hook [INFO] [stderr] 5: 0x7fec43775425 - std[57438abbadb2e169]::panicking::update_hook::<alloc[4d7db45d63a42c3c]::boxed::Box<rustc_driver_impl[238918c2a7efc1e2]::install_ice_hook::{closure#1}>>::{closure#0} [INFO] [stderr] 6: 0x7fec44a05182 - std[57438abbadb2e169]::panicking::panic_with_hook [INFO] [stderr] 7: 0x7fec449e2822 - std[57438abbadb2e169]::panicking::panic_handler::{closure#0} [INFO] [stderr] 8: 0x7fec449db009 - std[57438abbadb2e169]::sys::backtrace::__rust_end_short_backtrace::<std[57438abbadb2e169]::panicking::panic_handler::{closure#0}, !> [INFO] [stderr] 9: 0x7fec449e43fd - __rustc[bccf11a57dbda78d]::rust_begin_unwind [INFO] [stderr] 10: 0x7fec4140792c - core[782a08e82d10715a]::panicking::panic_fmt [INFO] [stderr] 11: 0x7fec45673e69 - rustc_hir_analysis[5bb798d8da0ae6e2]::check::compare_impl_item::compare_const_generic_param_types [INFO] [stderr] 12: 0x7fec456622f5 - rustc_hir_analysis[5bb798d8da0ae6e2]::check::compare_impl_item::compare_impl_item [INFO] [stderr] 13: 0x7fec4565f767 - rustc_query_impl[ccbfe29e0088bd0e]::query_vtables::compare_impl_item::invoke_provider_fn::__rust_begin_short_backtrace [INFO] [stderr] 14: 0x7fec45e3c96f - rustc_query_impl[ccbfe29e0088bd0e]::execution::try_execute_query::<rustc_data_structures[a3c6fdfb982c4575]::vec_cache::VecCache<rustc_span[e369a0e83a52414c]::def_id::LocalDefId, rustc_middle[cbdd7e3a753db913]::query::erase::ErasedData<[u8; 1usize]>, rustc_middle[cbdd7e3a753db913]::dep_graph::graph::DepNodeIndex>, false> [INFO] [stderr] 15: 0x7fec45e3c615 - rustc_query_impl[ccbfe29e0088bd0e]::query_vtables::compare_impl_item::execute_query_non_incr::__rust_end_short_backtrace [INFO] [stderr] 16: 0x7fec45e3fb2c - rustc_hir_analysis[5bb798d8da0ae6e2]::check::check::check_item_type [INFO] [stderr] 17: 0x7fec45e3d59c - rustc_hir_analysis[5bb798d8da0ae6e2]::check::wfcheck::check_well_formed [INFO] [stderr] 18: 0x7fec45e3d569 - rustc_query_impl[ccbfe29e0088bd0e]::query_vtables::check_well_formed::invoke_provider_fn::__rust_begin_short_backtrace [INFO] [stderr] 19: 0x7fec45e3c96f - rustc_query_impl[ccbfe29e0088bd0e]::execution::try_execute_query::<rustc_data_structures[a3c6fdfb982c4575]::vec_cache::VecCache<rustc_span[e369a0e83a52414c]::def_id::LocalDefId, rustc_middle[cbdd7e3a753db913]::query::erase::ErasedData<[u8; 1usize]>, rustc_middle[cbdd7e3a753db913]::dep_graph::graph::DepNodeIndex>, false> [INFO] [stderr] 20: 0x7fec45e3c6d5 - rustc_query_impl[ccbfe29e0088bd0e]::query_vtables::check_well_formed::execute_query_non_incr::__rust_end_short_backtrace [INFO] [stderr] 21: 0x7fec45e39fd1 - rustc_hir_analysis[5bb798d8da0ae6e2]::check::wfcheck::check_type_wf [INFO] [stderr] 22: 0x7fec45e39ecd - rustc_query_impl[ccbfe29e0088bd0e]::query_vtables::check_type_wf::invoke_provider_fn::__rust_begin_short_backtrace [INFO] [stderr] 23: 0x7fec4629e35e - rustc_query_impl[ccbfe29e0088bd0e]::execution::try_execute_query::<rustc_middle[cbdd7e3a753db913]::query::caches::SingleCache<rustc_middle[cbdd7e3a753db913]::query::erase::ErasedData<[u8; 1usize]>>, false> [INFO] [stderr] 24: 0x7fec4629e153 - rustc_query_impl[ccbfe29e0088bd0e]::query_vtables::check_type_wf::execute_query_non_incr::__rust_end_short_backtrace [INFO] [stderr] 25: 0x7fec456fe6bb - rustc_hir_analysis[5bb798d8da0ae6e2]::check_crate [INFO] [stderr] 26: 0x7fec457c77b9 - rustc_interface[1c556335a4399b6f]::passes::analysis [INFO] [stderr] 27: 0x7fec462a4087 - rustc_query_impl[ccbfe29e0088bd0e]::execution::try_execute_query::<rustc_middle[cbdd7e3a753db913]::query::caches::SingleCache<rustc_middle[cbdd7e3a753db913]::query::erase::ErasedData<[u8; 0usize]>>, false> [INFO] [stderr] 28: 0x7fec462a3e21 - rustc_query_impl[ccbfe29e0088bd0e]::query_vtables::analysis::execute_query_non_incr::__rust_end_short_backtrace [INFO] [stderr] 29: 0x7fec463722ce - rustc_interface[1c556335a4399b6f]::interface::run_compiler::<(), rustc_driver_impl[238918c2a7efc1e2]::compiler_entrypoint::{closure#0}>::{closure#2} [INFO] [stderr] 30: 0x7fec4639c542 - std[57438abbadb2e169]::sys::backtrace::__rust_begin_short_backtrace::<rustc_interface[1c556335a4399b6f]::util::run_in_thread_with_globals<rustc_interface[1c556335a4399b6f]::util::run_in_thread_pool_with_globals<rustc_interface[1c556335a4399b6f]::interface::run_compiler<(), rustc_driver_impl[238918c2a7efc1e2]::compiler_entrypoint::{closure#0}>::{closure#2}, ()>::{closure#0}, ()>::{closure#0}::{closure#0}, ()> [INFO] [stderr] 31: 0x7fec4639c2ed - <std[57438abbadb2e169]::thread::lifecycle::spawn_unchecked<rustc_interface[1c556335a4399b6f]::util::run_in_thread_with_globals<rustc_interface[1c556335a4399b6f]::util::run_in_thread_pool_with_globals<rustc_interface[1c556335a4399b6f]::interface::run_compiler<(), rustc_driver_impl[238918c2a7efc1e2]::compiler_entrypoint::{closure#0}>::{closure#2}, ()>::{closure#0}, ()>::{closure#0}::{closure#0}, ()>::{closure#1} as core[782a08e82d10715a]::ops::function::FnOnce<()>>::call_once::{shim:vtable#0} [INFO] [stderr] 32: 0x7fec463a795b - <std[57438abbadb2e169]::sys::thread::unix::Thread>::new::thread_start [INFO] [stderr] 33: 0x7fec3f482dfa - <unknown> [INFO] [stderr] 34: 0x7fec3f5163d4 - clone [INFO] [stderr] 35: 0x0 - <unknown> [INFO] [stderr] [INFO] [stderr] error: the compiler unexpectedly panicked. This is a bug [INFO] [stderr] [INFO] [stderr] note: we would appreciate a bug report: https://github.com/rust-lang/rust/issues/new?labels=C-bug%2C+I-ICE%2C+T-compiler&template=ice.md [INFO] [stderr] [INFO] [stderr] note: please make sure that you have updated to the latest nightly [INFO] [stderr] [INFO] [stderr] warning: the ICE couldn't be written to `/opt/rustwide/cargo-home/registry/src/index.crates.io-1949cf8c6b5b557f/decdn-client-0.0.3/rustc-ice-2026-10-12T00_05_06-12019.txt`: Read-only file system (os error 30) [INFO] [stderr] [INFO] [stderr] note: rustc 1.101.0-nightly (6f5da406b 2026-10-10) running on x86_64-unknown-linux-gnu [INFO] [stderr] [INFO] [stderr] note: compiler flags: --crate-type lib -C embed-bitcode=no -C debuginfo=2 [INFO] [stderr] [INFO] [stderr] note: some of the compiler flags provided by cargo are hidden [INFO] [stderr] [INFO] [stderr] query stack during panic: [INFO] [stderr] #0 [compare_impl_item] checking assoc item `ranged_store::<impl at /opt/rustwide/cargo-home/registry/src/index.crates.io-1949cf8c6b5b557f/decdn-client-0.0.3/src/ranged_store.rs:1370:1: 1370:46>::read::{anon_assoc#0}` is compatible with trait definition [INFO] [stderr] #1 [check_well_formed] checking that `ranged_store::<impl at /opt/rustwide/cargo-home/registry/src/index.crates.io-1949cf8c6b5b557f/decdn-client-0.0.3/src/ranged_store.rs:1370:1: 1370:46>` is well-formed [INFO] [stderr] ... and 2 other queries... use `env RUST_BACKTRACE=1` to see the full query stack [INFO] [stderr] [INFO] [stderr] thread 'rustc' (12023) panicked at /rustc-dev/6f5da406b56c2db6607202b63daee73aa8c61297/compiler/rustc_hir_analysis/src/check/compare_impl_item.rs:2144:64: [INFO] [stderr] DefId::expect_local: `DefId(401:83 ~ iroh_io[6a9a]::AsyncStreamReader::read::L)` isn't local [INFO] [stderr] stack backtrace: [INFO] [stderr] 0: 0x7fec44a114b6 - <<std[57438abbadb2e169]::sys::backtrace::BacktraceLock>::print::DisplayBacktrace as core[782a08e82d10715a]::fmt::Display>::fmt [INFO] [stderr] 1: 0x7fec45006ddf - core[782a08e82d10715a]::fmt::write [INFO] [stderr] 2: 0x7fec44a27a9c - <std[57438abbadb2e169]::sys::stdio::unix::Stderr as core[782a08e82d10715a]::io::write::Write>::write_fmt [INFO] [stderr] 3: 0x7fec449e276a - std[57438abbadb2e169]::panicking::default_hook::{closure#0} [INFO] [stderr] 4: 0x7fec44a04ce3 - std[57438abbadb2e169]::panicking::default_hook [INFO] [stderr] 5: 0x7fec43775425 - std[57438abbadb2e169]::panicking::update_hook::<alloc[4d7db45d63a42c3c]::boxed::Box<rustc_driver_impl[238918c2a7efc1e2]::install_ice_hook::{closure#1}>>::{closure#0} [INFO] [stderr] 6: 0x7fec44a05182 - std[57438abbadb2e169]::panicking::panic_with_hook [INFO] [stderr] 7: 0x7fec449e2822 - std[57438abbadb2e169]::panicking::panic_handler::{closure#0} [INFO] [stderr] 8: 0x7fec449db009 - std[57438abbadb2e169]::sys::backtrace::__rust_end_short_backtrace::<std[57438abbadb2e169]::panicking::panic_handler::{closure#0}, !> [INFO] [stderr] 9: 0x7fec449e43fd - __rustc[bccf11a57dbda78d]::rust_begin_unwind [INFO] [stderr] 10: 0x7fec4140792c - core[782a08e82d10715a]::panicking::panic_fmt [INFO] [stderr] 11: 0x7fec45673e69 - rustc_hir_analysis[5bb798d8da0ae6e2]::check::compare_impl_item::compare_const_generic_param_types [INFO] [stderr] 12: 0x7fec456622f5 - rustc_hir_analysis[5bb798d8da0ae6e2]::check::compare_impl_item::compare_impl_item [INFO] [stderr] 13: 0x7fec4565f767 - rustc_query_impl[ccbfe29e0088bd0e]::query_vtables::compare_impl_item::invoke_provider_fn::__rust_begin_short_backtrace [INFO] [stderr] 14: 0x7fec45e3c96f - rustc_query_impl[ccbfe29e0088bd0e]::execution::try_execute_query::<rustc_data_structures[a3c6fdfb982c4575]::vec_cache::VecCache<rustc_span[e369a0e83a52414c]::def_id::LocalDefId, rustc_middle[cbdd7e3a753db913]::query::erase::ErasedData<[u8; 1usize]>, rustc_middle[cbdd7e3a753db913]::dep_graph::graph::DepNodeIndex>, false> [INFO] [stderr] 15: 0x7fec45e3c615 - rustc_query_impl[ccbfe29e0088bd0e]::query_vtables::compare_impl_item::execute_query_non_incr::__rust_end_short_backtrace [INFO] [stderr] 16: 0x7fec45e3fb2c - rustc_hir_analysis[5bb798d8da0ae6e2]::check::check::check_item_type [INFO] [stderr] 17: 0x7fec45e3d59c - rustc_hir_analysis[5bb798d8da0ae6e2]::check::wfcheck::check_well_formed [INFO] [stderr] 18: 0x7fec45e3d569 - rustc_query_impl[ccbfe29e0088bd0e]::query_vtables::check_well_formed::invoke_provider_fn::__rust_begin_short_backtrace [INFO] [stderr] 19: 0x7fec45e3c96f - rustc_query_impl[ccbfe29e0088bd0e]::execution::try_execute_query::<rustc_data_structures[a3c6fdfb982c4575]::vec_cache::VecCache<rustc_span[e369a0e83a52414c]::def_id::LocalDefId, rustc_middle[cbdd7e3a753db913]::query::erase::ErasedData<[u8; 1usize]>, rustc_middle[cbdd7e3a753db913]::dep_graph::graph::DepNodeIndex>, false> [INFO] [stderr] 20: 0x7fec45e3c6d5 - rustc_query_impl[ccbfe29e0088bd0e]::query_vtables::check_well_formed::execute_query_non_incr::__rust_end_short_backtrace [INFO] [stderr] 21: 0x7fec45e39fd1 - rustc_hir_analysis[5bb798d8da0ae6e2]::check::wfcheck::check_type_wf [INFO] [stderr] 22: 0x7fec45e39ecd - rustc_query_impl[ccbfe29e0088bd0e]::query_vtables::check_type_wf::invoke_provider_fn::__rust_begin_short_backtrace [INFO] [stderr] 23: 0x7fec4629e35e - rustc_query_impl[ccbfe29e0088bd0e]::execution::try_execute_query::<rustc_middle[cbdd7e3a753db913]::query::caches::SingleCache<rustc_middle[cbdd7e3a753db913]::query::erase::ErasedData<[u8; 1usize]>>, false> [INFO] [stderr] 24: 0x7fec4629e153 - rustc_query_impl[ccbfe29e0088bd0e]::query_vtables::check_type_wf::execute_query_non_incr::__rust_end_short_backtrace [INFO] [stderr] 25: 0x7fec456fe6bb - rustc_hir_analysis[5bb798d8da0ae6e2]::check_crate [INFO] [stderr] 26: 0x7fec457c77b9 - rustc_interface[1c556335a4399b6f]::passes::analysis [INFO] [stderr] 27: 0x7fec462a4087 - rustc_query_impl[ccbfe29e0088bd0e]::execution::try_execute_query::<rustc_middle[cbdd7e3a753db913]::query::caches::SingleCache<rustc_middle[cbdd7e3a753db913]::query::erase::ErasedData<[u8; 0usize]>>, false> [INFO] [stderr] 28: 0x7fec462a3e21 - rustc_query_impl[ccbfe29e0088bd0e]::query_vtables::analysis::execute_query_non_incr::__rust_end_short_backtrace [INFO] [stderr] 29: 0x7fec463722ce - rustc_interface[1c556335a4399b6f]::interface::run_compiler::<(), rustc_driver_impl[238918c2a7efc1e2]::compiler_entrypoint::{closure#0}>::{closure#2} [INFO] [stderr] 30: 0x7fec4639c542 - std[57438abbadb2e169]::sys::backtrace::__rust_begin_short_backtrace::<rustc_interface[1c556335a4399b6f]::util::run_in_thread_with_globals<rustc_interface[1c556335a4399b6f]::util::run_in_thread_pool_with_globals<rustc_interface[1c556335a4399b6f]::interface::run_compiler<(), rustc_driver_impl[238918c2a7efc1e2]::compiler_entrypoint::{closure#0}>::{closure#2}, ()>::{closure#0}, ()>::{closure#0}::{closure#0}, ()> [INFO] [stderr] 31: 0x7fec4639c2ed - <std[57438abbadb2e169]::thread::lifecycle::spawn_unchecked<rustc_interface[1c556335a4399b6f]::util::run_in_thread_with_globals<rustc_interface[1c556335a4399b6f]::util::run_in_thread_pool_with_globals<rustc_interface[1c556335a4399b6f]::interface::run_compiler<(), rustc_driver_impl[238918c2a7efc1e2]::compiler_entrypoint::{closure#0}>::{closure#2}, ()>::{closure#0}, ()>::{closure#0}::{closure#0}, ()>::{closure#1} as core[782a08e82d10715a]::ops::function::FnOnce<()>>::call_once::{shim:vtable#0} [INFO] [stderr] 32: 0x7fec463a795b - <std[57438abbadb2e169]::sys::thread::unix::Thread>::new::thread_start [INFO] [stderr] 33: 0x7fec3f482dfa - <unknown> [INFO] [stderr] 34: 0x7fec3f5163d4 - clone [INFO] [stderr] 35: 0x0 - <unknown> [INFO] [stderr] [INFO] [stderr] error: the compiler unexpectedly panicked. This is a bug [INFO] [stderr] [INFO] [stderr] note: we would appreciate a bug report: https://github.com/rust-lang/rust/issues/new?labels=C-bug%2C+I-ICE%2C+T-compiler&template=ice.md [INFO] [stderr] [INFO] [stderr] note: please make sure that you have updated to the latest nightly [INFO] [stderr] [INFO] [stderr] warning: the ICE couldn't be written to `/opt/rustwide/cargo-home/registry/src/index.crates.io-1949cf8c6b5b557f/decdn-client-0.0.3/rustc-ice-2026-10-12T00_05_06-12019.txt`: Read-only file system (os error 30) [INFO] [stderr] [INFO] [stderr] note: rustc 1.101.0-nightly (6f5da406b 2026-10-10) running on x86_64-unknown-linux-gnu [INFO] [stderr] [INFO] [stderr] note: compiler flags: --crate-type lib -C embed-bitcode=no -C debuginfo=2 [INFO] [stderr] [INFO] [stderr] note: some of the compiler flags provided by cargo are hidden [INFO] [stderr] [INFO] [stderr] query stack during panic: [INFO] [stderr] #0 [compare_impl_item] checking assoc item `sink::<impl at /opt/rustwide/cargo-home/registry/src/index.crates.io-1949cf8c6b5b557f/decdn-client-0.0.3/src/sink.rs:115:1: 115:47>::read::{anon_assoc#0}` is compatible with trait definition [INFO] [stderr] #1 [check_well_formed] checking that `sink::<impl at /opt/rustwide/cargo-home/registry/src/index.crates.io-1949cf8c6b5b557f/decdn-client-0.0.3/src/sink.rs:115:1: 115:47>` is well-formed [INFO] [stderr] ... and 2 other queries... use `env RUST_BACKTRACE=1` to see the full query stack [INFO] [stderr] error: could not compile `decdn-client` (lib) [INFO] [stderr] [INFO] [stderr] Caused by: [INFO] [stderr] process didn't exit successfully: `/opt/rustwide/rustup-home/toolchains/nightly-x86_64-unknown-linux-gnu/bin/rustc --crate-name decdn_client --edition=2024 /opt/rustwide/cargo-home/registry/src/index.crates.io-1949cf8c6b5b557f/decdn-client-0.0.3/src/lib.rs --error-format=json --json=diagnostic-rendered-ansi,artifacts,future-incompat,unused-externs-silent --crate-type lib --emit=dep-info,metadata -C embed-bitcode=no -C debuginfo=2 --check-cfg 'cfg(docsrs,test)' --check-cfg 'cfg(feature, values("public-api-test", "test-util"))' -C metadata=d86ace5e21565338 -C extra-filename=-d832a5bbf601cfc6 --out-dir /opt/rustwide/target/x86_64-unknown-linux-gnu/debug/build/decdn-client/d832a5bbf601cfc6/out --target x86_64-unknown-linux-gnu -L dependency=/opt/rustwide/target/debug/build/alloy-rlp-derive/28e7fb711facd8e1/out -L dependency=/opt/rustwide/target/debug/build/alloy-sol-macro/ec504519aa07902e/out -L dependency=/opt/rustwide/target/debug/build/alloy-tx-macros/3c930dc521879a2b/out -L dependency=/opt/rustwide/target/debug/build/async-stream-impl/b1d097bfe28b0a8c/out -L dependency=/opt/rustwide/target/debug/build/async-trait/2bb7261c811c1f7f/out -L dependency=/opt/rustwide/target/debug/build/auto_impl/310b57fd6308a947/out -L dependency=/opt/rustwide/target/debug/build/clap_derive/505f0a973b4bac87/out -L dependency=/opt/rustwide/target/debug/build/curve25519-dalek-derive/819700d2ef7ea800/out -L dependency=/opt/rustwide/target/debug/build/data-encoding-macro-internal/c3fba890752f6733/out -L dependency=/opt/rustwide/target/debug/build/derive_more-impl/4cd23f689bdaf349/out -L dependency=/opt/rustwide/target/debug/build/displaydoc/52a8e20f71f2c6cc/out -L dependency=/opt/rustwide/target/debug/build/enum-assoc/96eaa0b6d2ab3890/out -L dependency=/opt/rustwide/target/debug/build/futures-macro/323f5a1e7d1d379a/out -L dependency=/opt/rustwide/target/debug/build/genawaiter-proc-macro/228f081d43709a61/out -L dependency=/opt/rustwide/target/debug/build/iroh-metrics-derive/00cab38d1f1f34d4/out -L dependency=/opt/rustwide/target/debug/build/jsonrpsee-proc-macros/786181aaf09e994e/out -L dependency=/opt/rustwide/target/debug/build/n0-error-macros/e8663cefdbf334fd/out -L dependency=/opt/rustwide/target/debug/build/num_enum_derive/02803497cc3bcfde/out -L dependency=/opt/rustwide/target/debug/build/paste/35f047675a76880e/out -L dependency=/opt/rustwide/target/debug/build/pin-project-internal/df58cb94e35f6a32/out -L dependency=/opt/rustwide/target/debug/build/postcard-derive/fb895bcccd4996c9/out -L dependency=/opt/rustwide/target/debug/build/proc-macro-hack/2e5620a2726e57c1/out -L dependency=/opt/rustwide/target/debug/build/ref-cast-impl/dc20c7dc981443fe/out -L dependency=/opt/rustwide/target/debug/build/ruint-macro/a0eecb5ef5e37c8f/out -L dependency=/opt/rustwide/target/debug/build/rustversion/acea2b2ba54cc62b/out -L dependency=/opt/rustwide/target/debug/build/serde_derive/60e37399b2055f9e/out -L dependency=/opt/rustwide/target/debug/build/serde_with_macros/5f1e1134ad462845/out -L dependency=/opt/rustwide/target/debug/build/spez/782d42fc74a552bd/out -L dependency=/opt/rustwide/target/debug/build/strum_macros/776f3253e6310148/out -L dependency=/opt/rustwide/target/debug/build/thiserror-impl/2441d956a7571d60/out -L dependency=/opt/rustwide/target/debug/build/thiserror-impl/b515b52582c16875/out -L dependency=/opt/rustwide/target/debug/build/tokio-macros/4ae693e8ed3bd1c2/out -L dependency=/opt/rustwide/target/debug/build/tracing-attributes/2f1734b1c6d01189/out -L dependency=/opt/rustwide/target/debug/build/yoke-derive/b6b240d44e969830/out -L dependency=/opt/rustwide/target/debug/build/zerocopy-derive/03c2f78dc18c91dc/out -L dependency=/opt/rustwide/target/debug/build/zerofrom-derive/063d8bad0ee2ab9a/out -L dependency=/opt/rustwide/target/debug/build/zeroize_derive/b66c0cc6bb3d7f5c/out -L dependency=/opt/rustwide/target/debug/build/zerovec-derive/500f42ba2d47d485/out -L dependency=/opt/rustwide/target/x86_64-unknown-linux-gnu/debug/build/aead/a9d7b373909bd4c7/out -L dependency=/opt/rustwide/target/x86_64-unknown-linux-gnu/debug/build/aes-gcm/f9cbfc8b15c7b29a/out -L dependency=/opt/rustwide/target/x86_64-unknown-linux-gnu/debug/build/aes/1e0410f741facbdf/out -L dependency=/opt/rustwide/target/x86_64-unknown-linux-gnu/debug/build/alloy-chains/04672ccf2f506c01/out -L dependency=/opt/rustwide/target/x86_64-unknown-linux-gnu/debug/build/alloy-consensus-any/3f18d1305bf59635/out -L dependency=/opt/rustwide/target/x86_64-unknown-linux-gnu/debug/build/alloy-consensus/5a1041d731c2a2a5/out -L dependency=/opt/rustwide/target/x86_64-unknown-linux-gnu/debug/build/alloy-contract/4212eba4a0690b64/out -L dependency=/opt/rustwide/target/x86_64-unknown-linux-gnu/debug/build/alloy-core/7c1ec130024eb00c/out -L dependency=/opt/rustwide/target/x86_64-unknown-linux-gnu/debug/build/alloy-dyn-abi/d2a5f9df8c9b9232/out -L dependency=/opt/rustwide/target/x86_64-unknown-linux-gnu/debug/build/alloy-eip2124/8acddbed65be4a4a/out -L dependency=/opt/rustwide/target/x86_64-unknown-linux-gnu/debug/build/alloy-eip2930/37f2aeb83c3a5c69/out -L dependency=/opt/rustwide/target/x86_64-unknown-linux-gnu/debug/build/alloy-eip7702/19edbeda4b552423/out -L dependency=/opt/rustwide/target/x86_64-unknown-linux-gnu/debug/build/alloy-eip7928/530d54818173d595/out -L dependency=/opt/rustwide/target/x86_64-unknown-linux-gnu/debug/build/alloy-eip8141/1e767bd62a69f767/out -L dependency=/opt/rustwide/target/x86_64-unknown-linux-gnu/debug/build/alloy-eips/a5f034f7749a24f2/out -L dependency=/opt/rustwide/target/x86_64-unknown-linux-gnu/debug/build/alloy-json-abi/a7f83702a8d0fd70/out -L dependency=/opt/rustwide/target/x86_64-unknown-linux-gnu/debug/build/alloy-json-rpc/37d69de9d756d950/out -L dependency=/opt/rustwide/target/x86_64-unknown-linux-gnu/debug/build/alloy-network-primitives/ff4d13063fd10e10/out -L dependency=/opt/rustwide/target/x86_64-unknown-linux-gnu/debug/build/alloy-network/64aea7270a602018/out -L dependency=/opt/rustwide/target/x86_64-unknown-linux-gnu/debug/build/alloy-primitives/d95657270e91abb5/out -L dependency=/opt/rustwide/target/x86_64-unknown-linux-gnu/debug/build/alloy-provider/6027d516edc6324d/out -L dependency=/opt/rustwide/target/x86_64-unknown-linux-gnu/debug/build/alloy-rlp/0164e8b96f1dd775/out -L dependency=/opt/rustwide/target/x86_64-unknown-linux-gnu/debug/build/alloy-rpc-client/773ef1cfe00f5610/out -L dependency=/opt/rustwide/target/x86_64-unknown-linux-gnu/debug/build/alloy-rpc-types-any/5310bbdd76cab528/out -L dependency=/opt/rustwide/target/x86_64-unknown-linux-gnu/debug/build/alloy-rpc-types-eth/77a9ba7aba175e33/out -L dependency=/opt/rustwide/target/x86_64-unknown-linux-gnu/debug/build/alloy-rpc-types/991e690875ada0d3/out -L dependency=/opt/rustwide/target/x86_64-unknown-linux-gnu/debug/build/alloy-serde/e85b3fb012976686/out -L dependency=/opt/rustwide/target/x86_64-unknown-linux-gnu/debug/build/alloy-signer-local/0cf6d4a47cd1fd20/out -L dependency=/opt/rustwide/target/x86_64-unknown-linux-gnu/debug/build/alloy-signer/2943962b241e727d/out -L dependency=/opt/rustwide/target/x86_64-unknown-linux-gnu/debug/build/alloy-sol-type-parser/dc1d7fe264376277/out -L dependency=/opt/rustwide/target/x86_64-unknown-linux-gnu/debug/build/alloy-sol-types/1590fe3171c58331/out -L dependency=/opt/rustwide/target/x86_64-unknown-linux-gnu/debug/build/alloy-transport-http/4800670345b11ac6/out -L dependency=/opt/rustwide/target/x86_64-unknown-linux-gnu/debug/build/alloy-transport/bfa12af6eb07e2d1/out -L dependency=/opt/rustwide/target/x86_64-unknown-linux-gnu/debug/build/alloy-trie/c3228f7ee3980b96/out -L dependency=/opt/rustwide/target/x86_64-unknown-linux-gnu/debug/build/alloy/28e5047a7fcd247d/out -L dependency=/opt/rustwide/target/x86_64-unknown-linux-gnu/debug/build/anstream/6302e651d6cf1fd7/out -L dependency=/opt/rustwide/target/x86_64-unknown-linux-gnu/debug/build/anstyle-parse/77df5e77794616d0/out -L dependency=/opt/rustwide/target/x86_64-unknown-linux-gnu/debug/build/anstyle-query/c735efbb0a5c21ae/out -L dependency=/opt/rustwide/target/x86_64-unknown-linux-gnu/debug/build/anstyle/3e3f50b6b4133d6d/out -L dependency=/opt/rustwide/target/x86_64-unknown-linux-gnu/debug/build/anyhow/dc2bfc1937e0573f/out -L dependency=/opt/rustwide/target/x86_64-unknown-linux-gnu/debug/build/arc-swap/30a9b7de34df27f0/out -L dependency=/opt/rustwide/target/x86_64-unknown-linux-gnu/debug/build/arrayvec/9f21e2a39592551c/out -L dependency=/opt/rustwide/target/x86_64-unknown-linux-gnu/debug/build/async-stream/8c0e5766dd49bbd7/out -L dependency=/opt/rustwide/target/x86_64-unknown-linux-gnu/debug/build/atomic-waker/1ee4dd6b35016bce/out -L dependency=/opt/rustwide/target/x86_64-unknown-linux-gnu/debug/build/attohttpc/bb9dda4c35165d90/out -L dependency=/opt/rustwide/target/x86_64-unknown-linux-gnu/debug/build/aws-lc-rs/a153a8d64375530a/out -L dependency=/opt/rustwide/target/x86_64-unknown-linux-gnu/debug/build/aws-lc-sys/ed0592d9a29c31ce/out -L dependency=/opt/rustwide/target/x86_64-unknown-linux-gnu/debug/build/backon/2d15a06033c35cb7/out -L dependency=/opt/rustwide/target/x86_64-unknown-linux-gnu/debug/build/bao-tree/e6143262b3ace1c4/out -L dependency=/opt/rustwide/target/x86_64-unknown-linux-gnu/debug/build/base16ct/bb852e19c5b64aaf/out -L dependency=/opt/rustwide/target/x86_64-unknown-linux-gnu/debug/build/base16ct/f25808b910e3d123/out -L dependency=/opt/rustwide/target/x86_64-unknown-linux-gnu/debug/build/base64/8d462520111e2cd1/out -L dependency=/opt/rustwide/target/x86_64-unknown-linux-gnu/debug/build/base64/b79286c55b8ddc46/out -L dependency=/opt/rustwide/target/x86_64-unknown-linux-gnu/debug/build/base64ct/8f4a5f50fda948fe/out -L dependency=/opt/rustwide/target/x86_64-unknown-linux-gnu/debug/build/binary-merge/b841afada2750091/out -L dependency=/opt/rustwide/target/x86_64-unknown-linux-gnu/debug/build/bitflags/6d8a34f97d43cf17/out -L dependency=/opt/rustwide/target/x86_64-unknown-linux-gnu/debug/build/blake3/4bbca398572a43c5/out -L dependency=/opt/rustwide/target/x86_64-unknown-linux-gnu/debug/build/block-buffer/0ac6516053e6c7ac/out -L dependency=/opt/rustwide/target/x86_64-unknown-linux-gnu/debug/build/block-buffer/3c78bc3af296ecb5/out -L dependency=/opt/rustwide/target/x86_64-unknown-linux-gnu/debug/build/byteorder/d6ea1a268a71e2df/out -L dependency=/opt/rustwide/target/x86_64-unknown-linux-gnu/debug/build/bytes/7abdbe8174aca953/out -L dependency=/opt/rustwide/target/x86_64-unknown-linux-gnu/debug/build/cfg-if/64129bc9a783b30c/out -L dependency=/opt/rustwide/target/x86_64-unknown-linux-gnu/debug/build/chacha20/74ea5ea1f4d8cc1c/out -L dependency=/opt/rustwide/target/x86_64-unknown-linux-gnu/debug/build/cipher/1b909371685d3027/out -L dependency=/opt/rustwide/target/x86_64-unknown-linux-gnu/debug/build/cipher/d9da67ad32a1aef1/out -L dependency=/opt/rustwide/target/x86_64-unknown-linux-gnu/debug/build/clap/ff3b7311ddd13c8a/out -L dependency=/opt/rustwide/target/x86_64-unknown-linux-gnu/debug/build/clap_builder/13dad117f5db70e7/out -L dependency=/opt/rustwide/target/x86_64-unknown-linux-gnu/debug/build/clap_lex/dc8105e08eba0757/out -L dependency=/opt/rustwide/target/x86_64-unknown-linux-gnu/debug/build/cmov/1350031ff0a9e2e4/out -L dependency=/opt/rustwide/target/x86_64-unknown-linux-gnu/debug/build/cobs/9c986f9d7b77024c/out -L dependency=/opt/rustwide/target/x86_64-unknown-linux-gnu/debug/build/colorchoice/57b12475a6a6ce5f/out -L dependency=/opt/rustwide/target/x86_64-unknown-linux-gnu/debug/build/const-hex/2ece1b97c210fea8/out -L dependency=/opt/rustwide/target/x86_64-unknown-linux-gnu/debug/build/const-oid/9149278e8e27009c/out -L dependency=/opt/rustwide/target/x86_64-unknown-linux-gnu/debug/build/const-oid/c2523e00a8d3a2f8/out -L dependency=/opt/rustwide/target/x86_64-unknown-linux-gnu/debug/build/constant_time_eq/55dc0f72bc989d95/out -L dependency=/opt/rustwide/target/x86_64-unknown-linux-gnu/debug/build/cordyceps/03f969f1410a7908/out -L dependency=/opt/rustwide/target/x86_64-unknown-linux-gnu/debug/build/cpufeatures/1b29d03fefd94e58/out -L dependency=/opt/rustwide/target/x86_64-unknown-linux-gnu/debug/build/cpufeatures/9cedb47b9aea73c1/out -L dependency=/opt/rustwide/target/x86_64-unknown-linux-gnu/debug/build/crc-catalog/1ef00c6324155be4/out -L dependency=/opt/rustwide/target/x86_64-unknown-linux-gnu/debug/build/crc/5b4a6150501ad7f6/out -L dependency=/opt/rustwide/target/x86_64-unknown-linux-gnu/debug/build/crossbeam-utils/a3270cfe9b211130/out -L dependency=/opt/rustwide/target/x86_64-unknown-linux-gnu/debug/build/crypto-bigint/143a6a67bd690ecf/out -L dependency=/opt/rustwide/target/x86_64-unknown-linux-gnu/debug/build/crypto-common/64b483f4d8b653b6/out -L dependency=/opt/rustwide/target/x86_64-unknown-linux-gnu/debug/build/crypto-common/973b9073c2cb0789/out -L dependency=/opt/rustwide/target/x86_64-unknown-linux-gnu/debug/build/ctr/22d57662226d8578/out -L dependency=/opt/rustwide/target/x86_64-unknown-linux-gnu/debug/build/ctutils/4f7e57934cf565f6/out -L dependency=/opt/rustwide/target/x86_64-unknown-linux-gnu/debug/build/curve25519-dalek/a9e2f1b7a3ad3863/out -L dependency=/opt/rustwide/target/x86_64-unknown-linux-gnu/debug/build/dashmap/7fadfee5035c4934/out -L dependency=/opt/rustwide/target/x86_64-unknown-linux-gnu/debug/build/data-encoding-macro/9ee61f6514fa1054/out -L dependency=/opt/rustwide/target/x86_64-unknown-linux-gnu/debug/build/data-encoding/a04a226ffa91c805/out -L dependency=/opt/rustwide/target/x86_64-unknown-linux-gnu/debug/build/decdn-common/3cf9410cf0a34bd7/out -L dependency=/opt/rustwide/target/x86_64-unknown-linux-gnu/debug/build/decdn-config-types/cdb1d1de37248127/out -L dependency=/opt/rustwide/target/x86_64-unknown-linux-gnu/debug/build/decdn-protocol/15e13e27c963fd0e/out -L dependency=/opt/rustwide/target/x86_64-unknown-linux-gnu/debug/build/der/2a2aee9dabc18e50/out -L dependency=/opt/rustwide/target/x86_64-unknown-linux-gnu/debug/build/der/412f564054e6408a/out -L dependency=/opt/rustwide/target/x86_64-unknown-linux-gnu/debug/build/deranged/b11f0a8b7995879f/out -L dependency=/opt/rustwide/target/x86_64-unknown-linux-gnu/debug/build/derive_more/75a6c1ef2a82157e/out -L dependency=/opt/rustwide/target/x86_64-unknown-linux-gnu/debug/build/diatomic-waker/cad97b42acae04ad/out -L dependency=/opt/rustwide/target/x86_64-unknown-linux-gnu/debug/build/digest/b2f220fe8949bf02/out -L dependency=/opt/rustwide/target/x86_64-unknown-linux-gnu/debug/build/digest/f626ffd59ca241ff/out -L dependency=/opt/rustwide/target/x86_64-unknown-linux-gnu/debug/build/dirs-sys/9a47d64e4fd4b222/out -L dependency=/opt/rustwide/target/x86_64-unknown-linux-gnu/debug/build/dirs/f20d2df714438236/out -L dependency=/opt/rustwide/target/x86_64-unknown-linux-gnu/debug/build/ecdsa/b6400b8d451632d5/out -L dependency=/opt/rustwide/target/x86_64-unknown-linux-gnu/debug/build/ed25519-dalek/a6215600d12444a8/out -L dependency=/opt/rustwide/target/x86_64-unknown-linux-gnu/debug/build/ed25519/c819a4c2002ea135/out -L dependency=/opt/rustwide/target/x86_64-unknown-linux-gnu/debug/build/either/dd140c247f8bb3f7/out -L dependency=/opt/rustwide/target/x86_64-unknown-linux-gnu/debug/build/elliptic-curve/078409bf36171453/out -L dependency=/opt/rustwide/target/x86_64-unknown-linux-gnu/debug/build/equivalent/356ffe6080aa9970/out -L dependency=/opt/rustwide/target/x86_64-unknown-linux-gnu/debug/build/errno/5de176a863cbc9df/out -L dependency=/opt/rustwide/target/x86_64-unknown-linux-gnu/debug/build/eth-keystore/7848833aa478020a/out -L dependency=/opt/rustwide/target/x86_64-unknown-linux-gnu/debug/build/fastbloom/f0e4024ed4ebc70a/out -L dependency=/opt/rustwide/target/x86_64-unknown-linux-gnu/debug/build/fastrand/e74e88e9c3940414/out -L dependency=/opt/rustwide/target/x86_64-unknown-linux-gnu/debug/build/ff/a9003989f8cc1c42/out -L dependency=/opt/rustwide/target/x86_64-unknown-linux-gnu/debug/build/fnv/7d1ab06971bea2e2/out -L dependency=/opt/rustwide/target/x86_64-unknown-linux-gnu/debug/build/foldhash/b35b53f250b14695/out -L dependency=/opt/rustwide/target/x86_64-unknown-linux-gnu/debug/build/form_urlencoded/0db4b226e86524ed/out -L dependency=/opt/rustwide/target/x86_64-unknown-linux-gnu/debug/build/fs4/b0e21aaf1d8ebc51/out -L dependency=/opt/rustwide/target/x86_64-unknown-linux-gnu/debug/build/futures-buffered/4e0ea650822c50b3/out -L dependency=/opt/rustwide/target/x86_64-unknown-linux-gnu/debug/build/futures-channel/87aad13054c52865/out -L dependency=/opt/rustwide/target/x86_64-unknown-linux-gnu/debug/build/futures-core/7f6dd8c80ce6e5b4/out -L dependency=/opt/rustwide/target/x86_64-unknown-linux-gnu/debug/build/futures-executor/81689661f5314d89/out -L dependency=/opt/rustwide/target/x86_64-unknown-linux-gnu/debug/build/futures-io/598c8bf06e0927c4/out -L dependency=/opt/rustwide/target/x86_64-unknown-linux-gnu/debug/build/futures-lite/b8c7fcaee839cc43/out -L dependency=/opt/rustwide/target/x86_64-unknown-linux-gnu/debug/build/futures-sink/8aa5cb0c3e6e7d04/out -L dependency=/opt/rustwide/target/x86_64-unknown-linux-gnu/debug/build/futures-task/57a6967e73f83fae/out -L dependency=/opt/rustwide/target/x86_64-unknown-linux-gnu/debug/build/futures-util/a8a91a75f461285f/out -L dependency=/opt/rustwide/target/x86_64-unknown-linux-gnu/debug/build/futures-utils-wasm/5097f2ac5cff9f29/out -L dependency=/opt/rustwide/target/x86_64-unknown-linux-gnu/debug/build/futures/413c16854c2532f4/out -L dependency=/opt/rustwide/target/x86_64-unknown-linux-gnu/debug/build/genawaiter-macro/9f5116aa80aaecc3/out -L dependency=/opt/rustwide/target/x86_64-unknown-linux-gnu/debug/build/genawaiter/de4b993918d3de1f/out -L dependency=/opt/rustwide/target/x86_64-unknown-linux-gnu/debug/build/generic-array/caf2e8b88387cf09/out -L dependency=/opt/rustwide/target/x86_64-unknown-linux-gnu/debug/build/getrandom/3b705ec22bc94c95/out -L dependency=/opt/rustwide/target/x86_64-unknown-linux-gnu/debug/build/getrandom/67226291ef75640c/out -L dependency=/opt/rustwide/target/x86_64-unknown-linux-gnu/debug/build/getrandom/743537f187a6d7e8/out -L dependency=/opt/rustwide/target/x86_64-unknown-linux-gnu/debug/build/ghash/02883ba1730192b2/out -L dependency=/opt/rustwide/target/x86_64-unknown-linux-gnu/debug/build/group/614b2103dff56546/out -L dependency=/opt/rustwide/target/x86_64-unknown-linux-gnu/debug/build/h2/d162f8a451c53d42/out -L dependency=/opt/rustwide/target/x86_64-unknown-linux-gnu/debug/build/hash32/bb1cc7afe26e53c6/out -L dependency=/opt/rustwide/target/x86_64-unknown-linux-gnu/debug/build/hashbrown/9f806b02e1f3dbed/out -L dependency=/opt/rustwide/target/x86_64-unknown-linux-gnu/debug/build/hashbrown/e2338f3c3676ca22/out -L dependency=/opt/rustwide/target/x86_64-unknown-linux-gnu/debug/build/heapless/73843c694c52d597/out -L dependency=/opt/rustwide/target/x86_64-unknown-linux-gnu/debug/build/hex/44f3b3add99d6f16/out -L dependency=/opt/rustwide/target/x86_64-unknown-linux-gnu/debug/build/hmac/65d7f3a01ae96f50/out -L dependency=/opt/rustwide/target/x86_64-unknown-linux-gnu/debug/build/http-body-util/bdd351108fab811e/out -L dependency=/opt/rustwide/target/x86_64-unknown-linux-gnu/debug/build/http-body/646bd1a71fe3407a/out -L dependency=/opt/rustwide/target/x86_64-unknown-linux-gnu/debug/build/http/893235d086389453/out -L dependency=/opt/rustwide/target/x86_64-unknown-linux-gnu/debug/build/httparse/6c5802cd412b1799/out -L dependency=/opt/rustwide/target/x86_64-unknown-linux-gnu/debug/build/httpdate/48501241ba6d0f9e/out -L dependency=/opt/rustwide/target/x86_64-unknown-linux-gnu/debug/build/hybrid-array/ab5b2357a054c384/out -L dependency=/opt/rustwide/target/x86_64-unknown-linux-gnu/debug/build/hyper-rustls/73ca1bbb7a3caa69/out -L dependency=/opt/rustwide/target/x86_64-unknown-linux-gnu/debug/build/hyper-util/3840566733f39a73/out -L dependency=/opt/rustwide/target/x86_64-unknown-linux-gnu/debug/build/hyper/3f4f22215c6e974f/out -L dependency=/opt/rustwide/target/x86_64-unknown-linux-gnu/debug/build/icu_collections/e9bae3308fa11961/out -L dependency=/opt/rustwide/target/x86_64-unknown-linux-gnu/debug/build/icu_locale_core/a965492d6b5741e8/out -L dependency=/opt/rustwide/target/x86_64-unknown-linux-gnu/debug/build/icu_normalizer/4622e759d97b01a8/out -L dependency=/opt/rustwide/target/x86_64-unknown-linux-gnu/debug/build/icu_normalizer_data/de33df044702a225/out -L dependency=/opt/rustwide/target/x86_64-unknown-linux-gnu/debug/build/icu_properties/96f9d86a1ab158d9/out -L dependency=/opt/rustwide/target/x86_64-unknown-linux-gnu/debug/build/icu_properties_data/7dac26fb7a566c04/out -L dependency=/opt/rustwide/target/x86_64-unknown-linux-gnu/debug/build/icu_provider/9d7c4d1faaf518d8/out -L dependency=/opt/rustwide/target/x86_64-unknown-linux-gnu/debug/build/identity-hash/73e6f9d05086cfdc/out -L dependency=/opt/rustwide/target/x86_64-unknown-linux-gnu/debug/build/idna/b238e3293c6cdfd3/out -L dependency=/opt/rustwide/target/x86_64-unknown-linux-gnu/debug/build/idna_adapter/a876c598951b82d6/out -L dependency=/opt/rustwide/target/x86_64-unknown-linux-gnu/debug/build/igd-next/79b00001de7b5068/out -L dependency=/opt/rustwide/target/x86_64-unknown-linux-gnu/debug/build/indexmap/99c82e88b9ccdcae/out -L dependency=/opt/rustwide/target/x86_64-unknown-linux-gnu/debug/build/inout/bff3929f0f797632/out -L dependency=/opt/rustwide/target/x86_64-unknown-linux-gnu/debug/build/inout/f5544dcca26c4580/out -L dependency=/opt/rustwide/target/x86_64-unknown-linux-gnu/debug/build/inplace-vec-builder/0cbb2860a9bb0968/out -L dependency=/opt/rustwide/target/x86_64-unknown-linux-gnu/debug/build/ipnet/9a9f70c67d9de840/out -L dependency=/opt/rustwide/target/x86_64-unknown-linux-gnu/debug/build/iroh-base/b3405f0d82062f81/out -L dependency=/opt/rustwide/target/x86_64-unknown-linux-gnu/debug/build/iroh-dns/1284e63acbdfbf26/out -L dependency=/opt/rustwide/target/x86_64-unknown-linux-gnu/debug/build/iroh-io/c9566424cdc6ad6a/out -L dependency=/opt/rustwide/target/x86_64-unknown-linux-gnu/debug/build/iroh-metrics/214a964d98d8957a/out -L dependency=/opt/rustwide/target/x86_64-unknown-linux-gnu/debug/build/iroh-relay/f6ea780a92f32d43/out -L dependency=/opt/rustwide/target/x86_64-unknown-linux-gnu/debug/build/iroh/59692901f2c42a49/out -L dependency=/opt/rustwide/target/x86_64-unknown-linux-gnu/debug/build/is_terminal_polyfill/cc67202a07d55c7a/out -L dependency=/opt/rustwide/target/x86_64-unknown-linux-gnu/debug/build/itertools/a63162d37f1ed5c0/out -L dependency=/opt/rustwide/target/x86_64-unknown-linux-gnu/debug/build/itoa/c7dfb0c4cf55b511/out -L dependency=/opt/rustwide/target/x86_64-unknown-linux-gnu/debug/build/jsonrpsee-core/ca9fac7167a33864/out -L dependency=/opt/rustwide/target/x86_64-unknown-linux-gnu/debug/build/jsonrpsee-http-client/258eda550a866e36/out -L dependency=/opt/rustwide/target/x86_64-unknown-linux-gnu/debug/build/jsonrpsee-server/41359349706d6329/out -L dependency=/opt/rustwide/target/x86_64-unknown-linux-gnu/debug/build/jsonrpsee-types/825ecd39a04768fe/out -L dependency=/opt/rustwide/target/x86_64-unknown-linux-gnu/debug/build/jsonrpsee/4059aca6ae1c98a9/out -L dependency=/opt/rustwide/target/x86_64-unknown-linux-gnu/debug/build/k256/f1413e5d7f3ec480/out -L dependency=/opt/rustwide/target/x86_64-unknown-linux-gnu/debug/build/keccak/0416c38f1713d4da/out -L dependency=/opt/rustwide/target/x86_64-unknown-linux-gnu/debug/build/keccak/d2f2d0ec89b6c34c/out -L dependency=/opt/rustwide/target/x86_64-unknown-linux-gnu/debug/build/libc/2eee126b2dd8b848/out -L dependency=/opt/rustwide/target/x86_64-unknown-linux-gnu/debug/build/libm/a615231ddb18d19d/out -L dependency=/opt/rustwide/target/x86_64-unknown-linux-gnu/debug/build/linux-raw-sys/56287fb4cd2f1b0a/out -L dependency=/opt/rustwide/target/x86_64-unknown-linux-gnu/debug/build/litemap/6950ecd26e84d74f/out -L dependency=/opt/rustwide/target/x86_64-unknown-linux-gnu/debug/build/lock_api/74b6d469d28e7fb8/out -L dependency=/opt/rustwide/target/x86_64-unknown-linux-gnu/debug/build/log/581a5414c584e6cc/out -L dependency=/opt/rustwide/target/x86_64-unknown-linux-gnu/debug/build/lru-slab/ee0611f3e007e89f/out -L dependency=/opt/rustwide/target/x86_64-unknown-linux-gnu/debug/build/lru/6303bd914941668c/out -L dependency=/opt/rustwide/target/x86_64-unknown-linux-gnu/debug/build/mac-addr/ea272d9190c6d711/out -L dependency=/opt/rustwide/target/x86_64-unknown-linux-gnu/debug/build/memchr/56f4b3c6fe372526/out -L dependency=/opt/rustwide/target/x86_64-unknown-linux-gnu/debug/build/mio/55c6b79677daa1e5/out -L dependency=/opt/rustwide/target/x86_64-unknown-linux-gnu/debug/build/n0-dns-resolver/112f00af7d2cf0cc/out -L dependency=/opt/rustwide/target/x86_64-unknown-linux-gnu/debug/build/n0-error/14e3b420b5e61b33/out -L dependency=/opt/rustwide/target/x86_64-unknown-linux-gnu/debug/build/n0-future/ee4c9dbc37b6c8f6/out -L dependency=/opt/rustwide/target/x86_64-unknown-linux-gnu/debug/build/n0-watcher/da4777cc8a6f29b3/out -L dependency=/opt/rustwide/target/x86_64-unknown-linux-gnu/debug/build/netdev/d493b0bce25b79b3/out -L dependency=/opt/rustwide/target/x86_64-unknown-linux-gnu/debug/build/netlink-packet-core/c89453f30f8c2622/out -L dependency=/opt/rustwide/target/x86_64-unknown-linux-gnu/debug/build/netlink-packet-core/cea3b31bbc1dcd98/out -L dependency=/opt/rustwide/target/x86_64-unknown-linux-gnu/debug/build/netlink-packet-route/99e7f4c29fe2032a/out -L dependency=/opt/rustwide/target/x86_64-unknown-linux-gnu/debug/build/netlink-packet-route/be3400befeaf7a72/out -L dependency=/opt/rustwide/target/x86_64-unknown-linux-gnu/debug/build/netlink-proto/6acff4e1d2a9eaa2/out -L dependency=/opt/rustwide/target/x86_64-unknown-linux-gnu/debug/build/netlink-sys/b0d7b5f0431d91a1/out -L dependency=/opt/rustwide/target/x86_64-unknown-linux-gnu/debug/build/netlink-sys/e2dcfbbd16f7d726/out -L dependency=/opt/rustwide/target/x86_64-unknown-linux-gnu/debug/build/netwatch/bc403add342e99b8/out -L dependency=/opt/rustwide/target/x86_64-unknown-linux-gnu/debug/build/noq-proto/e395eb49c2eef85f/out -L dependency=/opt/rustwide/target/x86_64-unknown-linux-gnu/debug/build/noq-udp/02dcf9192a3802cf/out -L dependency=/opt/rustwide/target/x86_64-unknown-linux-gnu/debug/build/noq/55fac6c431893584/out -L dependency=/opt/rustwide/target/x86_64-unknown-linux-gnu/debug/build/num-conv/31ae0e227ddb2751/out -L dependency=/opt/rustwide/target/x86_64-unknown-linux-gnu/debug/build/num_enum/5dc9d9a235e96535/out -L dependency=/opt/rustwide/target/x86_64-unknown-linux-gnu/debug/build/nybbles/9aefbfa9400fc9ef/out -L dependency=/opt/rustwide/target/x86_64-unknown-linux-gnu/debug/build/once_cell/99dfa8c2adc0e264/out -L dependency=/opt/rustwide/target/x86_64-unknown-linux-gnu/debug/build/opaque-debug/2dca9aece6027530/out -L dependency=/opt/rustwide/target/x86_64-unknown-linux-gnu/debug/build/openssl-probe/579c38e5569400ad/out -L dependency=/opt/rustwide/target/x86_64-unknown-linux-gnu/debug/build/option-ext/3023cb71f0d7a316/out -L dependency=/opt/rustwide/target/x86_64-unknown-linux-gnu/debug/build/papaya/c075303398809d87/out -L dependency=/opt/rustwide/target/x86_64-unknown-linux-gnu/debug/build/parking/09206e406a740ceb/out -L dependency=/opt/rustwide/target/x86_64-unknown-linux-gnu/debug/build/parking_lot/85494084a2027a38/out -L dependency=/opt/rustwide/target/x86_64-unknown-linux-gnu/debug/build/parking_lot_core/1df19293526ba1c5/out -L dependency=/opt/rustwide/target/x86_64-unknown-linux-gnu/debug/build/pbkdf2/cf177ca2f53c49cb/out -L dependency=/opt/rustwide/target/x86_64-unknown-linux-gnu/debug/build/pem-rfc7468/cfba1e45fbbf6b5f/out -L dependency=/opt/rustwide/target/x86_64-unknown-linux-gnu/debug/build/percent-encoding/8ee2a12faa4bea7c/out -L dependency=/opt/rustwide/target/x86_64-unknown-linux-gnu/debug/build/phf/7740cf6883c4b047/out -L dependency=/opt/rustwide/target/x86_64-unknown-linux-gnu/debug/build/phf_shared/790ee092484bf66a/out -L dependency=/opt/rustwide/target/x86_64-unknown-linux-gnu/debug/build/pin-project-lite/bc47108c5d8f25ae/out -L dependency=/opt/rustwide/target/x86_64-unknown-linux-gnu/debug/build/pin-project/13c6d531cd3f9c7d/out -L dependency=/opt/rustwide/target/x86_64-unknown-linux-gnu/debug/build/pkcs8/26d6fd1160d4a0cf/out -L dependency=/opt/rustwide/target/x86_64-unknown-linux-gnu/debug/build/polyval/b403fa837ff5864e/out -L dependency=/opt/rustwide/target/x86_64-unknown-linux-gnu/debug/build/portable-atomic/c4c0a99083099231/out -L dependency=/opt/rustwide/target/x86_64-unknown-linux-gnu/debug/build/portmapper/2f5284da1e3dca74/out -L dependency=/opt/rustwide/target/x86_64-unknown-linux-gnu/debug/build/positioned-io/b9c32c52b41d0a2e/out -L dependency=/opt/rustwide/target/x86_64-unknown-linux-gnu/debug/build/postcard/23685a252f4b59ae/out -L dependency=/opt/rustwide/target/x86_64-unknown-linux-gnu/debug/build/potential_utf/3302a60756c62a47/out -L dependency=/opt/rustwide/target/x86_64-unknown-linux-gnu/debug/build/powerfmt/be1ccbb9deb5e01d/out -L dependency=/opt/rustwide/target/x86_64-unknown-linux-gnu/debug/build/ppv-lite86/c040586e3d214128/out -L dependency=/opt/rustwide/target/x86_64-unknown-linux-gnu/debug/build/rand/6114d24f897a1807/out -L dependency=/opt/rustwide/target/x86_64-unknown-linux-gnu/debug/build/rand/cb05d94fd300832d/out -L dependency=/opt/rustwide/target/x86_64-unknown-linux-gnu/debug/build/rand/dbecfd82eb144e25/out -L dependency=/opt/rustwide/target/x86_64-unknown-linux-gnu/debug/build/rand_chacha/1d202d50159ce471/out -L dependency=/opt/rustwide/target/x86_64-unknown-linux-gnu/debug/build/rand_chacha/d15ca75650b298ad/out -L dependency=/opt/rustwide/target/x86_64-unknown-linux-gnu/debug/build/rand_core/5dd3abd9f0e58f6e/out -L dependency=/opt/rustwide/target/x86_64-unknown-linux-gnu/debug/build/rand_core/b428739067e0dffa/out -L dependency=/opt/rustwide/target/x86_64-unknown-linux-gnu/debug/build/rand_core/ff70fce9220e5cdd/out -L dependency=/opt/rustwide/target/x86_64-unknown-linux-gnu/debug/build/rand_pcg/310e45add3999900/out -L dependency=/opt/rustwide/target/x86_64-unknown-linux-gnu/debug/build/range-collections/60ef12ad8b7a0694/out -L dependency=/opt/rustwide/target/x86_64-unknown-linux-gnu/debug/build/redb/bce14a9a7e3ce20c/out -L dependency=/opt/rustwide/target/x86_64-unknown-linux-gnu/debug/build/ref-cast/760960873630993d/out -L dependency=/opt/rustwide/target/x86_64-unknown-linux-gnu/debug/build/reqwest/cba4f07ace0c089c/out -L dependency=/opt/rustwide/target/x86_64-unknown-linux-gnu/debug/build/rfc6979/4ae3ba8a95a64f8f/out -L dependency=/opt/rustwide/target/x86_64-unknown-linux-gnu/debug/build/ring/cd3c2ff59f56f6fb/out -L dependency=/opt/rustwide/target/x86_64-unknown-linux-gnu/debug/build/route-recognizer/5e8e44b97ac24068/out -L dependency=/opt/rustwide/target/x86_64-unknown-linux-gnu/debug/build/rpassword/372d12bc79b88781/out -L dependency=/opt/rustwide/target/x86_64-unknown-linux-gnu/debug/build/rtoolbox/e5893fda8f3bb4c6/out -L dependency=/opt/rustwide/target/x86_64-unknown-linux-gnu/debug/build/ruint/9d3e73ac7f0e89c0/out -L dependency=/opt/rustwide/target/x86_64-unknown-linux-gnu/debug/build/rustc-hash/0c8827cc88ac4f78/out -L dependency=/opt/rustwide/target/x86_64-unknown-linux-gnu/debug/build/rustix/590cb249328e5b51/out -L dependency=/opt/rustwide/target/x86_64-unknown-linux-gnu/debug/build/rustls-native-certs/e1a470b29f99f1cb/out -L dependency=/opt/rustwide/target/x86_64-unknown-linux-gnu/debug/build/rustls-pki-types/c37ce8db3f4fea8d/out -L dependency=/opt/rustwide/target/x86_64-unknown-linux-gnu/debug/build/rustls-platform-verifier/36629049340c0ab6/out -L dependency=/opt/rustwide/target/x86_64-unknown-linux-gnu/debug/build/rustls-platform-verifier/431732e24a485e7c/out -L dependency=/opt/rustwide/target/x86_64-unknown-linux-gnu/debug/build/rustls-webpki/37efc62ef97de29f/out -L dependency=/opt/rustwide/target/x86_64-unknown-linux-gnu/debug/build/rustls/16b9cd8b761bbc47/out -L dependency=/opt/rustwide/target/x86_64-unknown-linux-gnu/debug/build/ryu/0ab78070e7f1387c/out -L dependency=/opt/rustwide/target/x86_64-unknown-linux-gnu/debug/build/salsa20/ceeddedfb538a0a0/out -L dependency=/opt/rustwide/target/x86_64-unknown-linux-gnu/debug/build/scopeguard/cb69a910c37095f0/out -L dependency=/opt/rustwide/target/x86_64-unknown-linux-gnu/debug/build/scrypt/508ded22c9ff6294/out -L dependency=/opt/rustwide/target/x86_64-unknown-linux-gnu/debug/build/sec1/0f2fb1d20dd28683/out -L dependency=/opt/rustwide/target/x86_64-unknown-linux-gnu/debug/build/seize/d3deef878486cc41/out -L dependency=/opt/rustwide/target/x86_64-unknown-linux-gnu/debug/build/self_cell/f386b1621cb7e4bd/out -L dependency=/opt/rustwide/target/x86_64-unknown-linux-gnu/debug/build/serde/aea43131a03528fe/out -L dependency=/opt/rustwide/target/x86_64-unknown-linux-gnu/debug/build/serde_bytes/73f9074a6adaa656/out -L dependency=/opt/rustwide/target/x86_64-unknown-linux-gnu/debug/build/serde_core/fe9fd367ae2cbc2b/out -L dependency=/opt/rustwide/target/x86_64-unknown-linux-gnu/debug/build/serde_json/8cdefa99b7b54856/out -L dependency=/opt/rustwide/target/x86_64-unknown-linux-gnu/debug/build/serde_spanned/8d3144fcb2dae971/out -L dependency=/opt/rustwide/target/x86_64-unknown-linux-gnu/debug/build/serde_with/54af9fbf9d6d571b/out -L dependency=/opt/rustwide/target/x86_64-unknown-linux-gnu/debug/build/serdect/bafc7885e85f8b87/out -L dependency=/opt/rustwide/target/x86_64-unknown-linux-gnu/debug/build/sha1/e3ccfd3ce1016df0/out -L dependency=/opt/rustwide/target/x86_64-unknown-linux-gnu/debug/build/sha1_smol/0faf3c2b9f99d3d6/out -L dependency=/opt/rustwide/target/x86_64-unknown-linux-gnu/debug/build/sha2/91220602888bfb63/out -L dependency=/opt/rustwide/target/x86_64-unknown-linux-gnu/debug/build/sha2/c4a1768e4393e41e/out -L dependency=/opt/rustwide/target/x86_64-unknown-linux-gnu/debug/build/sha3/3e225c9892a2c799/out -L dependency=/opt/rustwide/target/x86_64-unknown-linux-gnu/debug/build/sha3/e1ff72ddd6ab94d2/out -L dependency=/opt/rustwide/target/x86_64-unknown-linux-gnu/debug/build/signal-hook-registry/f3c62b5d672fe1de/out -L dependency=/opt/rustwide/target/x86_64-unknown-linux-gnu/debug/build/signature/422ee31e7a71ad34/out -L dependency=/opt/rustwide/target/x86_64-unknown-linux-gnu/debug/build/signature/d176114c12150dd6/out -L dependency=/opt/rustwide/target/x86_64-unknown-linux-gnu/debug/build/simdutf8/704fe1bbeec62a1f/out -L dependency=/opt/rustwide/target/x86_64-unknown-linux-gnu/debug/build/simple-dns/c5e3c4c75ccae1e7/out -L dependency=/opt/rustwide/target/x86_64-unknown-linux-gnu/debug/build/siphasher/da44cfdd0d5f891d/out -L dependency=/opt/rustwide/target/x86_64-unknown-linux-gnu/debug/build/slab/514469061b8e15e7/out -L dependency=/opt/rustwide/target/x86_64-unknown-linux-gnu/debug/build/smallvec/54726509d2c0010b/out -L dependency=/opt/rustwide/target/x86_64-unknown-linux-gnu/debug/build/socket2/f5f846406d4550c2/out -L dependency=/opt/rustwide/target/x86_64-unknown-linux-gnu/debug/build/soketto/bd7bdbe2f37a6089/out -L dependency=/opt/rustwide/target/x86_64-unknown-linux-gnu/debug/build/sorted-index-buffer/35c6627c8802c08d/out -L dependency=/opt/rustwide/target/x86_64-unknown-linux-gnu/debug/build/spin/44809ae8faf91132/out -L dependency=/opt/rustwide/target/x86_64-unknown-linux-gnu/debug/build/spin/624f3f4f573a3c83/out -L dependency=/opt/rustwide/target/x86_64-unknown-linux-gnu/debug/build/spki/6602b066f10cd760/out -L dependency=/opt/rustwide/target/x86_64-unknown-linux-gnu/debug/build/spki/c27ae13fc1c0bdd9/out -L dependency=/opt/rustwide/target/x86_64-unknown-linux-gnu/debug/build/stable_deref_trait/cc29e2eb4af995bb/out -L dependency=/opt/rustwide/target/x86_64-unknown-linux-gnu/debug/build/strsim/70cae33bcd7dd7c9/out -L dependency=/opt/rustwide/target/x86_64-unknown-linux-gnu/debug/build/strum/8d6334e2a5873b46/out -L dependency=/opt/rustwide/target/x86_64-unknown-linux-gnu/debug/build/subtle/c41cb393c7692340/out -L dependency=/opt/rustwide/target/x86_64-unknown-linux-gnu/debug/build/sync_wrapper/12215b6d832316e4/out -L dependency=/opt/rustwide/target/x86_64-unknown-linux-gnu/debug/build/thiserror/7cd77a027f5f7226/out -L dependency=/opt/rustwide/target/x86_64-unknown-linux-gnu/debug/build/thiserror/dbb7b7b63880dc5b/out -L dependency=/opt/rustwide/target/x86_64-unknown-linux-gnu/debug/build/time-core/49be3c2b76f1f91d/out -L dependency=/opt/rustwide/target/x86_64-unknown-linux-gnu/debug/build/time/08f1774acbee2693/out -L dependency=/opt/rustwide/target/x86_64-unknown-linux-gnu/debug/build/tinystr/3e07f5038d9db2ee/out -L dependency=/opt/rustwide/target/x86_64-unknown-linux-gnu/debug/build/tinyvec/65be470e6c06cde5/out -L dependency=/opt/rustwide/target/x86_64-unknown-linux-gnu/debug/build/tokio-rustls/9a52f09271ed3b39/out -L dependency=/opt/rustwide/target/x86_64-unknown-linux-gnu/debug/build/tokio-stream/b6c7b1b3cc9e8be8/out -L dependency=/opt/rustwide/target/x86_64-unknown-linux-gnu/debug/build/tokio-util/adf2f7d0dc456407/out -L dependency=/opt/rustwide/target/x86_64-unknown-linux-gnu/debug/build/tokio-websockets/25e16d188af96f91/out -L dependency=/opt/rustwide/target/x86_64-unknown-linux-gnu/debug/build/tokio/b63bdf2e8db48d84/out -L dependency=/opt/rustwide/target/x86_64-unknown-linux-gnu/debug/build/toml/48b03437432136a8/out -L dependency=/opt/rustwide/target/x86_64-unknown-linux-gnu/debug/build/toml_datetime/f0144a310c101efb/out -L dependency=/opt/rustwide/target/x86_64-unknown-linux-gnu/debug/build/toml_parser/f68c5e51147c163b/out -L dependency=/opt/rustwide/target/x86_64-unknown-linux-gnu/debug/build/toml_writer/3849ac843f35c01f/out -L dependency=/opt/rustwide/target/x86_64-unknown-linux-gnu/debug/build/tower-http/d53335c048d24de3/out -L dependency=/opt/rustwide/target/x86_64-unknown-linux-gnu/debug/build/tower-layer/f80f0a0cfa5e2d11/out -L dependency=/opt/rustwide/target/x86_64-unknown-linux-gnu/debug/build/tower-service/415a761b7ca3059d/out -L dependency=/opt/rustwide/target/x86_64-unknown-linux-gnu/debug/build/tower/f160d8e8a4b7c72f/out -L dependency=/opt/rustwide/target/x86_64-unknown-linux-gnu/debug/build/tracing-core/f84c62a05ff5e545/out -L dependency=/opt/rustwide/target/x86_64-unknown-linux-gnu/debug/build/tracing/acbcb1b1ce5e746b/out -L dependency=/opt/rustwide/target/x86_64-unknown-linux-gnu/debug/build/try-lock/04e7f12c80193707/out -L dependency=/opt/rustwide/target/x86_64-unknown-linux-gnu/debug/build/typenum/2beadf215648d917/out -L dependency=/opt/rustwide/target/x86_64-unknown-linux-gnu/debug/build/universal-hash/6788f544c6d5e8a3/out -L dependency=/opt/rustwide/target/x86_64-unknown-linux-gnu/debug/build/untrusted/f6c5f8f27801f358/out -L dependency=/opt/rustwide/target/x86_64-unknown-linux-gnu/debug/build/url/04777652d37f20f4/out -L dependency=/opt/rustwide/target/x86_64-unknown-linux-gnu/debug/build/utf8_iter/3a94834afadbc640/out -L dependency=/opt/rustwide/target/x86_64-unknown-linux-gnu/debug/build/utf8parse/d53ecf6177e2cf1f/out -L dependency=/opt/rustwide/target/x86_64-unknown-linux-gnu/debug/build/uuid/3c7fcc6e1e0ff1d4/out -L dependency=/opt/rustwide/target/x86_64-unknown-linux-gnu/debug/build/want/99941ac8680c0356/out -L dependency=/opt/rustwide/target/x86_64-unknown-linux-gnu/debug/build/webpki-roots/221adc7ca421a873/out -L dependency=/opt/rustwide/target/x86_64-unknown-linux-gnu/debug/build/winnow/c47385772746fde4/out -L dependency=/opt/rustwide/target/x86_64-unknown-linux-gnu/debug/build/writeable/e05c6b00d7ca546b/out -L dependency=/opt/rustwide/target/x86_64-unknown-linux-gnu/debug/build/xml-rs/387097f123fab703/out -L dependency=/opt/rustwide/target/x86_64-unknown-linux-gnu/debug/build/xmltree/816b85526469f3f5/out -L dependency=/opt/rustwide/target/x86_64-unknown-linux-gnu/debug/build/yoke/9802088cb4b5c975/out -L dependency=/opt/rustwide/target/x86_64-unknown-linux-gnu/debug/build/zerocopy/a99114310b8b8be7/out -L dependency=/opt/rustwide/target/x86_64-unknown-linux-gnu/debug/build/zerofrom/e1054ba370332aad/out -L dependency=/opt/rustwide/target/x86_64-unknown-linux-gnu/debug/build/zeroize/e28dc484d4cb2dbd/out -L dependency=/opt/rustwide/target/x86_64-unknown-linux-gnu/debug/build/zerotrie/3c043a8668a65548/out -L dependency=/opt/rustwide/target/x86_64-unknown-linux-gnu/debug/build/zerovec/f17f3d2e28108b2c/out -L dependency=/opt/rustwide/target/x86_64-unknown-linux-gnu/debug/build/zmij/af95491124e15c46/out -L dependency=/opt/rustwide/target/debug/build/decdn-client/d832a5bbf601cfc6/out --extern alloy=/opt/rustwide/target/x86_64-unknown-linux-gnu/debug/build/alloy/28e5047a7fcd247d/out/liballoy-28e5047a7fcd247d.rmeta --extern anyhow=/opt/rustwide/target/x86_64-unknown-linux-gnu/debug/build/anyhow/dc2bfc1937e0573f/out/libanyhow-dc2bfc1937e0573f.rmeta --extern bao_tree=/opt/rustwide/target/x86_64-unknown-linux-gnu/debug/build/bao-tree/e6143262b3ace1c4/out/libbao_tree-e6143262b3ace1c4.rmeta --extern blake3=/opt/rustwide/target/x86_64-unknown-linux-gnu/debug/build/blake3/4bbca398572a43c5/out/libblake3-4bbca398572a43c5.rmeta --extern bytes=/opt/rustwide/target/x86_64-unknown-linux-gnu/debug/build/bytes/7abdbe8174aca953/out/libbytes-7abdbe8174aca953.rmeta --extern decdn_bao_range=/opt/rustwide/target/x86_64-unknown-linux-gnu/debug/build/decdn-bao-range/1616bd8b18f40066/out/libdecdn_bao_range-1616bd8b18f40066.rmeta --extern decdn_common=/opt/rustwide/target/x86_64-unknown-linux-gnu/debug/build/decdn-common/3cf9410cf0a34bd7/out/libdecdn_common-3cf9410cf0a34bd7.rmeta --extern decdn_incentive=/opt/rustwide/target/x86_64-unknown-linux-gnu/debug/build/decdn-incentive/9607fc00271b1512/out/libdecdn_incentive-9607fc00271b1512.rmeta --extern decdn_protocol=/opt/rustwide/target/x86_64-unknown-linux-gnu/debug/build/decdn-protocol/15e13e27c963fd0e/out/libdecdn_protocol-15e13e27c963fd0e.rmeta --extern futures_util=/opt/rustwide/target/x86_64-unknown-linux-gnu/debug/build/futures-util/a8a91a75f461285f/out/libfutures_util-a8a91a75f461285f.rmeta --extern iroh=/opt/rustwide/target/x86_64-unknown-linux-gnu/debug/build/iroh/59692901f2c42a49/out/libiroh-59692901f2c42a49.rmeta --extern iroh_io=/opt/rustwide/target/x86_64-unknown-linux-gnu/debug/build/iroh-io/c9566424cdc6ad6a/out/libiroh_io-c9566424cdc6ad6a.rmeta --extern rand=/opt/rustwide/target/x86_64-unknown-linux-gnu/debug/build/rand/cb05d94fd300832d/out/librand-cb05d94fd300832d.rmeta --extern serde=/opt/rustwide/target/x86_64-unknown-linux-gnu/debug/build/serde/aea43131a03528fe/out/libserde-aea43131a03528fe.rmeta --extern serde_json=/opt/rustwide/target/x86_64-unknown-linux-gnu/debug/build/serde_json/8cdefa99b7b54856/out/libserde_json-8cdefa99b7b54856.rmeta --extern tempfile=/opt/rustwide/target/x86_64-unknown-linux-gnu/debug/build/tempfile/4ca386e4f4c79f95/out/libtempfile-4ca386e4f4c79f95.rmeta --extern tokio=/opt/rustwide/target/x86_64-unknown-linux-gnu/debug/build/tokio/b63bdf2e8db48d84/out/libtokio-b63bdf2e8db48d84.rmeta --extern tokio_util=/opt/rustwide/target/x86_64-unknown-linux-gnu/debug/build/tokio-util/adf2f7d0dc456407/out/libtokio_util-adf2f7d0dc456407.rmeta --extern tracing=/opt/rustwide/target/x86_64-unknown-linux-gnu/debug/build/tracing/acbcb1b1ce5e746b/out/libtracing-acbcb1b1ce5e746b.rmeta --cap-lints allow --force-warn=unused_crate_dependencies -L native=/opt/rustwide/target/x86_64-unknown-linux-gnu/debug/build/aws-lc-sys/b5bc0f4f395b8ae8/out -L native=/opt/rustwide/target/x86_64-unknown-linux-gnu/debug/build/ring/23d4c39807bead7f/out -L native=/opt/rustwide/target/x86_64-unknown-linux-gnu/debug/build/blake3/a8abf3c2e3bbe681/out -L native=/opt/rustwide/target/x86_64-unknown-linux-gnu/debug/build/blake3/a8abf3c2e3bbe681/out` (exit status: 101) [INFO] [stderr] warning: build failed, waiting for other jobs to finish... [INFO] [stderr] [INFO] [stderr] thread 'rustc' (12021) panicked at /rustc-dev/6f5da406b56c2db6607202b63daee73aa8c61297/compiler/rustc_hir_analysis/src/check/compare_impl_item.rs:2144:64: [INFO] [stderr] DefId::expect_local: `DefId(33:83 ~ iroh_io[6a9a]::AsyncStreamReader::read::L)` isn't local [INFO] [stderr] stack backtrace: [INFO] [stderr] 0: 0x7fa1606114b6 - <<std[57438abbadb2e169]::sys::backtrace::BacktraceLock>::print::DisplayBacktrace as core[782a08e82d10715a]::fmt::Display>::fmt [INFO] [stderr] 1: 0x7fa160c06ddf - core[782a08e82d10715a]::fmt::write [INFO] [stderr] 2: 0x7fa160627a9c - <std[57438abbadb2e169]::sys::stdio::unix::Stderr as core[782a08e82d10715a]::io::write::Write>::write_fmt [INFO] [stderr] 3: 0x7fa1605e276a - std[57438abbadb2e169]::panicking::default_hook::{closure#0} [INFO] [stderr] 4: 0x7fa160604ce3 - std[57438abbadb2e169]::panicking::default_hook [INFO] [stderr] 5: 0x7fa15f375425 - std[57438abbadb2e169]::panicking::update_hook::<alloc[4d7db45d63a42c3c]::boxed::Box<rustc_driver_impl[238918c2a7efc1e2]::install_ice_hook::{closure#1}>>::{closure#0} [INFO] [stderr] 6: 0x7fa160605182 - std[57438abbadb2e169]::panicking::panic_with_hook [INFO] [stderr] 7: 0x7fa1605e2822 - std[57438abbadb2e169]::panicking::panic_handler::{closure#0} [INFO] [stderr] 8: 0x7fa1605db009 - std[57438abbadb2e169]::sys::backtrace::__rust_end_short_backtrace::<std[57438abbadb2e169]::panicking::panic_handler::{closure#0}, !> [INFO] [stderr] 9: 0x7fa1605e43fd - __rustc[bccf11a57dbda78d]::rust_begin_unwind [INFO] [stderr] 10: 0x7fa15d00792c - core[782a08e82d10715a]::panicking::panic_fmt [INFO] [stderr] 11: 0x7fa161273e69 - rustc_hir_analysis[5bb798d8da0ae6e2]::check::compare_impl_item::compare_const_generic_param_types [INFO] [stderr] 12: 0x7fa1612622f5 - rustc_hir_analysis[5bb798d8da0ae6e2]::check::compare_impl_item::compare_impl_item [INFO] [stderr] 13: 0x7fa16125f767 - rustc_query_impl[ccbfe29e0088bd0e]::query_vtables::compare_impl_item::invoke_provider_fn::__rust_begin_short_backtrace [INFO] [stderr] 14: 0x7fa161a3c96f - rustc_query_impl[ccbfe29e0088bd0e]::execution::try_execute_query::<rustc_data_structures[a3c6fdfb982c4575]::vec_cache::VecCache<rustc_span[e369a0e83a52414c]::def_id::LocalDefId, rustc_middle[cbdd7e3a753db913]::query::erase::ErasedData<[u8; 1usize]>, rustc_middle[cbdd7e3a753db913]::dep_graph::graph::DepNodeIndex>, false> [INFO] [stderr] 15: 0x7fa161a3c615 - rustc_query_impl[ccbfe29e0088bd0e]::query_vtables::compare_impl_item::execute_query_non_incr::__rust_end_short_backtrace [INFO] [stderr] 16: 0x7fa161a3fb2c - rustc_hir_analysis[5bb798d8da0ae6e2]::check::check::check_item_type [INFO] [stderr] 17: 0x7fa161a3d59c - rustc_hir_analysis[5bb798d8da0ae6e2]::check::wfcheck::check_well_formed [INFO] [stderr] 18: 0x7fa161a3d569 - rustc_query_impl[ccbfe29e0088bd0e]::query_vtables::check_well_formed::invoke_provider_fn::__rust_begin_short_backtrace [INFO] [stderr] 19: 0x7fa161a3c96f - rustc_query_impl[ccbfe29e0088bd0e]::execution::try_execute_query::<rustc_data_structures[a3c6fdfb982c4575]::vec_cache::VecCache<rustc_span[e369a0e83a52414c]::def_id::LocalDefId, rustc_middle[cbdd7e3a753db913]::query::erase::ErasedData<[u8; 1usize]>, rustc_middle[cbdd7e3a753db913]::dep_graph::graph::DepNodeIndex>, false> [INFO] [stderr] 20: 0x7fa161a3c6d5 - rustc_query_impl[ccbfe29e0088bd0e]::query_vtables::check_well_formed::execute_query_non_incr::__rust_end_short_backtrace [INFO] [stderr] 21: 0x7fa161a39fd1 - rustc_hir_analysis[5bb798d8da0ae6e2]::check::wfcheck::check_type_wf [INFO] [stderr] 22: 0x7fa161a39ecd - rustc_query_impl[ccbfe29e0088bd0e]::query_vtables::check_type_wf::invoke_provider_fn::__rust_begin_short_backtrace [INFO] [stderr] 23: 0x7fa161e9e35e - rustc_query_impl[ccbfe29e0088bd0e]::execution::try_execute_query::<rustc_middle[cbdd7e3a753db913]::query::caches::SingleCache<rustc_middle[cbdd7e3a753db913]::query::erase::ErasedData<[u8; 1usize]>>, false> [INFO] [stderr] 24: 0x7fa161e9e153 - rustc_query_impl[ccbfe29e0088bd0e]::query_vtables::check_type_wf::execute_query_non_incr::__rust_end_short_backtrace [INFO] [stderr] 25: 0x7fa1612fe6bb - rustc_hir_analysis[5bb798d8da0ae6e2]::check_crate [INFO] [stderr] 26: 0x7fa1613c77b9 - rustc_interface[1c556335a4399b6f]::passes::analysis [INFO] [stderr] 27: 0x7fa161ea4087 - rustc_query_impl[ccbfe29e0088bd0e]::execution::try_execute_query::<rustc_middle[cbdd7e3a753db913]::query::caches::SingleCache<rustc_middle[cbdd7e3a753db913]::query::erase::ErasedData<[u8; 0usize]>>, false> [INFO] [stderr] 28: 0x7fa161ea3e21 - rustc_query_impl[ccbfe29e0088bd0e]::query_vtables::analysis::execute_query_non_incr::__rust_end_short_backtrace [INFO] [stderr] 29: 0x7fa161f722ce - rustc_interface[1c556335a4399b6f]::interface::run_compiler::<(), rustc_driver_impl[238918c2a7efc1e2]::compiler_entrypoint::{closure#0}>::{closure#2} [INFO] [stderr] 30: 0x7fa161f9c542 - std[57438abbadb2e169]::sys::backtrace::__rust_begin_short_backtrace::<rustc_interface[1c556335a4399b6f]::util::run_in_thread_with_globals<rustc_interface[1c556335a4399b6f]::util::run_in_thread_pool_with_globals<rustc_interface[1c556335a4399b6f]::interface::run_compiler<(), rustc_driver_impl[238918c2a7efc1e2]::compiler_entrypoint::{closure#0}>::{closure#2}, ()>::{closure#0}, ()>::{closure#0}::{closure#0}, ()> [INFO] [stderr] 31: 0x7fa161f9c2ed - <std[57438abbadb2e169]::thread::lifecycle::spawn_unchecked<rustc_interface[1c556335a4399b6f]::util::run_in_thread_with_globals<rustc_interface[1c556335a4399b6f]::util::run_in_thread_pool_with_globals<rustc_interface[1c556335a4399b6f]::interface::run_compiler<(), rustc_driver_impl[238918c2a7efc1e2]::compiler_entrypoint::{closure#0}>::{closure#2}, ()>::{closure#0}, ()>::{closure#0}::{closure#0}, ()>::{closure#1} as core[782a08e82d10715a]::ops::function::FnOnce<()>>::call_once::{shim:vtable#0} [INFO] [stderr] 32: 0x7fa161fa795b - <std[57438abbadb2e169]::sys::thread::unix::Thread>::new::thread_start [INFO] [stderr] 33: 0x7fa15b082dfa - <unknown> [INFO] [stderr] 34: 0x7fa15b1163d4 - clone [INFO] [stderr] 35: 0x0 - <unknown> [INFO] [stderr] [INFO] [stderr] error: the compiler unexpectedly panicked. This is a bug [INFO] [stderr] [INFO] [stderr] note: we would appreciate a bug report: https://github.com/rust-lang/rust/issues/new?labels=C-bug%2C+I-ICE%2C+T-compiler&template=ice.md [INFO] [stderr] [INFO] [stderr] note: please make sure that you have updated to the latest nightly [INFO] [stderr] [INFO] [stderr] warning: the ICE couldn't be written to `/opt/rustwide/cargo-home/registry/src/index.crates.io-1949cf8c6b5b557f/iroh-blobs-0.103.1/rustc-ice-2026-10-12T00_05_06-12018.txt`: Read-only file system (os error 30) [INFO] [stderr] [INFO] [stderr] note: rustc 1.101.0-nightly (6f5da406b 2026-10-10) running on x86_64-unknown-linux-gnu [INFO] [stderr] [INFO] [stderr] note: compiler flags: --crate-type lib -C embed-bitcode=no -C debuginfo=2 [INFO] [stderr] [INFO] [stderr] note: some of the compiler flags provided by cargo are hidden [INFO] [stderr] [INFO] [stderr] query stack during panic: [INFO] [stderr] #0 [compare_impl_item] checking assoc item `util::stream::<impl at /opt/rustwide/cargo-home/registry/src/index.crates.io-1949cf8c6b5b557f/iroh-blobs-0.103.1/src/util/stream.rs:340:1: 340:73>::read::{anon_assoc#0}` is compatible with trait definition [INFO] [stderr] #1 [check_well_formed] checking that `util::stream::<impl at /opt/rustwide/cargo-home/registry/src/index.crates.io-1949cf8c6b5b557f/iroh-blobs-0.103.1/src/util/stream.rs:340:1: 340:73>` is well-formed [INFO] [stderr] ... and 2 other queries... use `env RUST_BACKTRACE=1` to see the full query stack [INFO] [stderr] error: could not compile `iroh-blobs` (lib) [INFO] [stderr] [INFO] [stderr] Caused by: [INFO] [stderr] process didn't exit successfully: `/opt/rustwide/rustup-home/toolchains/nightly-x86_64-unknown-linux-gnu/bin/rustc --crate-name iroh_blobs --edition=2021 /opt/rustwide/cargo-home/registry/src/index.crates.io-1949cf8c6b5b557f/iroh-blobs-0.103.1/src/lib.rs --error-format=json --json=diagnostic-rendered-ansi,artifacts,future-incompat,unused-externs-silent --crate-type lib --emit=dep-info,metadata -C embed-bitcode=no -C debuginfo=2 --cfg 'feature="default"' --cfg 'feature="fs-store"' --cfg 'feature="hide-proto-docs"' --cfg 'feature="rpc"' --check-cfg 'cfg(docsrs,test)' --check-cfg 'cfg(feature, values("default", "fs-store", "hide-proto-docs", "metrics", "rpc"))' -C metadata=ee8d5b5db4104ffb -C extra-filename=-9725435dff648db4 --out-dir /opt/rustwide/target/x86_64-unknown-linux-gnu/debug/build/iroh-blobs/9725435dff648db4/out --target x86_64-unknown-linux-gnu -L dependency=/opt/rustwide/target/debug/build/curve25519-dalek-derive/819700d2ef7ea800/out -L dependency=/opt/rustwide/target/debug/build/data-encoding-macro-internal/c3fba890752f6733/out -L dependency=/opt/rustwide/target/debug/build/derive_more-impl/4cd23f689bdaf349/out -L dependency=/opt/rustwide/target/debug/build/displaydoc/52a8e20f71f2c6cc/out -L dependency=/opt/rustwide/target/debug/build/enum-assoc/96eaa0b6d2ab3890/out -L dependency=/opt/rustwide/target/debug/build/futures-macro/323f5a1e7d1d379a/out -L dependency=/opt/rustwide/target/debug/build/genawaiter-proc-macro/228f081d43709a61/out -L dependency=/opt/rustwide/target/debug/build/iroh-metrics-derive/00cab38d1f1f34d4/out -L dependency=/opt/rustwide/target/debug/build/irpc-derive/c16d2781517e9d09/out -L dependency=/opt/rustwide/target/debug/build/n0-error-macros/e8663cefdbf334fd/out -L dependency=/opt/rustwide/target/debug/build/num_enum_derive/02803497cc3bcfde/out -L dependency=/opt/rustwide/target/debug/build/paste/35f047675a76880e/out -L dependency=/opt/rustwide/target/debug/build/pin-project-internal/df58cb94e35f6a32/out -L dependency=/opt/rustwide/target/debug/build/postcard-derive/fb895bcccd4996c9/out -L dependency=/opt/rustwide/target/debug/build/proc-macro-hack/2e5620a2726e57c1/out -L dependency=/opt/rustwide/target/debug/build/ref-cast-impl/dc20c7dc981443fe/out -L dependency=/opt/rustwide/target/debug/build/rustversion/acea2b2ba54cc62b/out -L dependency=/opt/rustwide/target/debug/build/serde_derive/60e37399b2055f9e/out -L dependency=/opt/rustwide/target/debug/build/spez/782d42fc74a552bd/out -L dependency=/opt/rustwide/target/debug/build/strum_macros/776f3253e6310148/out -L dependency=/opt/rustwide/target/debug/build/thiserror-impl/2441d956a7571d60/out -L dependency=/opt/rustwide/target/debug/build/tokio-macros/4ae693e8ed3bd1c2/out -L dependency=/opt/rustwide/target/debug/build/tracing-attributes/2f1734b1c6d01189/out -L dependency=/opt/rustwide/target/debug/build/yoke-derive/b6b240d44e969830/out -L dependency=/opt/rustwide/target/debug/build/zerocopy-derive/03c2f78dc18c91dc/out -L dependency=/opt/rustwide/target/debug/build/zerofrom-derive/063d8bad0ee2ab9a/out -L dependency=/opt/rustwide/target/debug/build/zeroize_derive/b66c0cc6bb3d7f5c/out -L dependency=/opt/rustwide/target/debug/build/zerovec-derive/500f42ba2d47d485/out -L dependency=/opt/rustwide/target/x86_64-unknown-linux-gnu/debug/build/aead/a9d7b373909bd4c7/out -L dependency=/opt/rustwide/target/x86_64-unknown-linux-gnu/debug/build/aes-gcm/f9cbfc8b15c7b29a/out -L dependency=/opt/rustwide/target/x86_64-unknown-linux-gnu/debug/build/aes/1e0410f741facbdf/out -L dependency=/opt/rustwide/target/x86_64-unknown-linux-gnu/debug/build/arc-swap/30a9b7de34df27f0/out -L dependency=/opt/rustwide/target/x86_64-unknown-linux-gnu/debug/build/arrayvec/9f21e2a39592551c/out -L dependency=/opt/rustwide/target/x86_64-unknown-linux-gnu/debug/build/atomic-waker/1ee4dd6b35016bce/out -L dependency=/opt/rustwide/target/x86_64-unknown-linux-gnu/debug/build/attohttpc/bb9dda4c35165d90/out -L dependency=/opt/rustwide/target/x86_64-unknown-linux-gnu/debug/build/aws-lc-rs/a153a8d64375530a/out -L dependency=/opt/rustwide/target/x86_64-unknown-linux-gnu/debug/build/aws-lc-sys/ed0592d9a29c31ce/out -L dependency=/opt/rustwide/target/x86_64-unknown-linux-gnu/debug/build/backon/2d15a06033c35cb7/out -L dependency=/opt/rustwide/target/x86_64-unknown-linux-gnu/debug/build/base16ct/bb852e19c5b64aaf/out -L dependency=/opt/rustwide/target/x86_64-unknown-linux-gnu/debug/build/base64/8d462520111e2cd1/out -L dependency=/opt/rustwide/target/x86_64-unknown-linux-gnu/debug/build/base64/b79286c55b8ddc46/out -L dependency=/opt/rustwide/target/x86_64-unknown-linux-gnu/debug/build/base64ct/8f4a5f50fda948fe/out -L dependency=/opt/rustwide/target/x86_64-unknown-linux-gnu/debug/build/binary-merge/b841afada2750091/out -L dependency=/opt/rustwide/target/x86_64-unknown-linux-gnu/debug/build/bitflags/6d8a34f97d43cf17/out -L dependency=/opt/rustwide/target/x86_64-unknown-linux-gnu/debug/build/blake3/4bbca398572a43c5/out -L dependency=/opt/rustwide/target/x86_64-unknown-linux-gnu/debug/build/block-buffer/3c78bc3af296ecb5/out -L dependency=/opt/rustwide/target/x86_64-unknown-linux-gnu/debug/build/byteorder/d6ea1a268a71e2df/out -L dependency=/opt/rustwide/target/x86_64-unknown-linux-gnu/debug/build/bytes/7abdbe8174aca953/out -L dependency=/opt/rustwide/target/x86_64-unknown-linux-gnu/debug/build/cfg-if/64129bc9a783b30c/out -L dependency=/opt/rustwide/target/x86_64-unknown-linux-gnu/debug/build/chacha20/74ea5ea1f4d8cc1c/out -L dependency=/opt/rustwide/target/x86_64-unknown-linux-gnu/debug/build/cipher/1b909371685d3027/out -L dependency=/opt/rustwide/target/x86_64-unknown-linux-gnu/debug/build/cipher/d9da67ad32a1aef1/out -L dependency=/opt/rustwide/target/x86_64-unknown-linux-gnu/debug/build/cmov/1350031ff0a9e2e4/out -L dependency=/opt/rustwide/target/x86_64-unknown-linux-gnu/debug/build/cobs/9c986f9d7b77024c/out -L dependency=/opt/rustwide/target/x86_64-unknown-linux-gnu/debug/build/const-oid/c2523e00a8d3a2f8/out -L dependency=/opt/rustwide/target/x86_64-unknown-linux-gnu/debug/build/constant_time_eq/55dc0f72bc989d95/out -L dependency=/opt/rustwide/target/x86_64-unknown-linux-gnu/debug/build/cordyceps/03f969f1410a7908/out -L dependency=/opt/rustwide/target/x86_64-unknown-linux-gnu/debug/build/cpufeatures/1b29d03fefd94e58/out -L dependency=/opt/rustwide/target/x86_64-unknown-linux-gnu/debug/build/cpufeatures/9cedb47b9aea73c1/out -L dependency=/opt/rustwide/target/x86_64-unknown-linux-gnu/debug/build/crypto-common/64b483f4d8b653b6/out -L dependency=/opt/rustwide/target/x86_64-unknown-linux-gnu/debug/build/crypto-common/973b9073c2cb0789/out -L dependency=/opt/rustwide/target/x86_64-unknown-linux-gnu/debug/build/ctr/22d57662226d8578/out -L dependency=/opt/rustwide/target/x86_64-unknown-linux-gnu/debug/build/ctutils/4f7e57934cf565f6/out -L dependency=/opt/rustwide/target/x86_64-unknown-linux-gnu/debug/build/curve25519-dalek/a9e2f1b7a3ad3863/out -L dependency=/opt/rustwide/target/x86_64-unknown-linux-gnu/debug/build/data-encoding-macro/9ee61f6514fa1054/out -L dependency=/opt/rustwide/target/x86_64-unknown-linux-gnu/debug/build/data-encoding/a04a226ffa91c805/out -L dependency=/opt/rustwide/target/x86_64-unknown-linux-gnu/debug/build/der/2a2aee9dabc18e50/out -L dependency=/opt/rustwide/target/x86_64-unknown-linux-gnu/debug/build/deranged/b11f0a8b7995879f/out -L dependency=/opt/rustwide/target/x86_64-unknown-linux-gnu/debug/build/derive_more/75a6c1ef2a82157e/out -L dependency=/opt/rustwide/target/x86_64-unknown-linux-gnu/debug/build/diatomic-waker/cad97b42acae04ad/out -L dependency=/opt/rustwide/target/x86_64-unknown-linux-gnu/debug/build/digest/f626ffd59ca241ff/out -L dependency=/opt/rustwide/target/x86_64-unknown-linux-gnu/debug/build/ed25519-dalek/a6215600d12444a8/out -L dependency=/opt/rustwide/target/x86_64-unknown-linux-gnu/debug/build/ed25519/c819a4c2002ea135/out -L dependency=/opt/rustwide/target/x86_64-unknown-linux-gnu/debug/build/equivalent/356ffe6080aa9970/out -L dependency=/opt/rustwide/target/x86_64-unknown-linux-gnu/debug/build/errno/5de176a863cbc9df/out -L dependency=/opt/rustwide/target/x86_64-unknown-linux-gnu/debug/build/fastbloom/f0e4024ed4ebc70a/out -L dependency=/opt/rustwide/target/x86_64-unknown-linux-gnu/debug/build/fastrand/e74e88e9c3940414/out -L dependency=/opt/rustwide/target/x86_64-unknown-linux-gnu/debug/build/fnv/7d1ab06971bea2e2/out -L dependency=/opt/rustwide/target/x86_64-unknown-linux-gnu/debug/build/foldhash/b35b53f250b14695/out -L dependency=/opt/rustwide/target/x86_64-unknown-linux-gnu/debug/build/form_urlencoded/0db4b226e86524ed/out -L dependency=/opt/rustwide/target/x86_64-unknown-linux-gnu/debug/build/futures-buffered/4e0ea650822c50b3/out -L dependency=/opt/rustwide/target/x86_64-unknown-linux-gnu/debug/build/futures-channel/87aad13054c52865/out -L dependency=/opt/rustwide/target/x86_64-unknown-linux-gnu/debug/build/futures-core/7f6dd8c80ce6e5b4/out -L dependency=/opt/rustwide/target/x86_64-unknown-linux-gnu/debug/build/futures-executor/81689661f5314d89/out -L dependency=/opt/rustwide/target/x86_64-unknown-linux-gnu/debug/build/futures-io/598c8bf06e0927c4/out -L dependency=/opt/rustwide/target/x86_64-unknown-linux-gnu/debug/build/futures-lite/b8c7fcaee839cc43/out -L dependency=/opt/rustwide/target/x86_64-unknown-linux-gnu/debug/build/futures-sink/8aa5cb0c3e6e7d04/out -L dependency=/opt/rustwide/target/x86_64-unknown-linux-gnu/debug/build/futures-task/57a6967e73f83fae/out -L dependency=/opt/rustwide/target/x86_64-unknown-linux-gnu/debug/build/futures-util/a8a91a75f461285f/out -L dependency=/opt/rustwide/target/x86_64-unknown-linux-gnu/debug/build/futures/413c16854c2532f4/out -L dependency=/opt/rustwide/target/x86_64-unknown-linux-gnu/debug/build/genawaiter-macro/9f5116aa80aaecc3/out -L dependency=/opt/rustwide/target/x86_64-unknown-linux-gnu/debug/build/genawaiter/de4b993918d3de1f/out -L dependency=/opt/rustwide/target/x86_64-unknown-linux-gnu/debug/build/generic-array/caf2e8b88387cf09/out -L dependency=/opt/rustwide/target/x86_64-unknown-linux-gnu/debug/build/getrandom/3b705ec22bc94c95/out -L dependency=/opt/rustwide/target/x86_64-unknown-linux-gnu/debug/build/getrandom/743537f187a6d7e8/out -L dependency=/opt/rustwide/target/x86_64-unknown-linux-gnu/debug/build/ghash/02883ba1730192b2/out -L dependency=/opt/rustwide/target/x86_64-unknown-linux-gnu/debug/build/h2/d162f8a451c53d42/out -L dependency=/opt/rustwide/target/x86_64-unknown-linux-gnu/debug/build/hash32/bb1cc7afe26e53c6/out -L dependency=/opt/rustwide/target/x86_64-unknown-linux-gnu/debug/build/hashbrown/9f806b02e1f3dbed/out -L dependency=/opt/rustwide/target/x86_64-unknown-linux-gnu/debug/build/heapless/73843c694c52d597/out -L dependency=/opt/rustwide/target/x86_64-unknown-linux-gnu/debug/build/http-body-util/bdd351108fab811e/out -L dependency=/opt/rustwide/target/x86_64-unknown-linux-gnu/debug/build/http-body/646bd1a71fe3407a/out -L dependency=/opt/rustwide/target/x86_64-unknown-linux-gnu/debug/build/http/893235d086389453/out -L dependency=/opt/rustwide/target/x86_64-unknown-linux-gnu/debug/build/httparse/6c5802cd412b1799/out -L dependency=/opt/rustwide/target/x86_64-unknown-linux-gnu/debug/build/httpdate/48501241ba6d0f9e/out -L dependency=/opt/rustwide/target/x86_64-unknown-linux-gnu/debug/build/hybrid-array/ab5b2357a054c384/out -L dependency=/opt/rustwide/target/x86_64-unknown-linux-gnu/debug/build/hyper-rustls/73ca1bbb7a3caa69/out -L dependency=/opt/rustwide/target/x86_64-unknown-linux-gnu/debug/build/hyper-util/3840566733f39a73/out -L dependency=/opt/rustwide/target/x86_64-unknown-linux-gnu/debug/build/hyper/3f4f22215c6e974f/out -L dependency=/opt/rustwide/target/x86_64-unknown-linux-gnu/debug/build/iana-time-zone/7d179f524c36002b/out -L dependency=/opt/rustwide/target/x86_64-unknown-linux-gnu/debug/build/icu_collections/e9bae3308fa11961/out -L dependency=/opt/rustwide/target/x86_64-unknown-linux-gnu/debug/build/icu_locale_core/a965492d6b5741e8/out -L dependency=/opt/rustwide/target/x86_64-unknown-linux-gnu/debug/build/icu_normalizer/4622e759d97b01a8/out -L dependency=/opt/rustwide/target/x86_64-unknown-linux-gnu/debug/build/icu_normalizer_data/de33df044702a225/out -L dependency=/opt/rustwide/target/x86_64-unknown-linux-gnu/debug/build/icu_properties/96f9d86a1ab158d9/out -L dependency=/opt/rustwide/target/x86_64-unknown-linux-gnu/debug/build/icu_properties_data/7dac26fb7a566c04/out -L dependency=/opt/rustwide/target/x86_64-unknown-linux-gnu/debug/build/icu_provider/9d7c4d1faaf518d8/out -L dependency=/opt/rustwide/target/x86_64-unknown-linux-gnu/debug/build/identity-hash/73e6f9d05086cfdc/out -L dependency=/opt/rustwide/target/x86_64-unknown-linux-gnu/debug/build/idna/b238e3293c6cdfd3/out -L dependency=/opt/rustwide/target/x86_64-unknown-linux-gnu/debug/build/idna_adapter/a876c598951b82d6/out -L dependency=/opt/rustwide/target/x86_64-unknown-linux-gnu/debug/build/igd-next/79b00001de7b5068/out -L dependency=/opt/rustwide/target/x86_64-unknown-linux-gnu/debug/build/indexmap/99c82e88b9ccdcae/out -L dependency=/opt/rustwide/target/x86_64-unknown-linux-gnu/debug/build/inout/bff3929f0f797632/out -L dependency=/opt/rustwide/target/x86_64-unknown-linux-gnu/debug/build/inout/f5544dcca26c4580/out -L dependency=/opt/rustwide/target/x86_64-unknown-linux-gnu/debug/build/inplace-vec-builder/0cbb2860a9bb0968/out -L dependency=/opt/rustwide/target/x86_64-unknown-linux-gnu/debug/build/ipnet/9a9f70c67d9de840/out -L dependency=/opt/rustwide/target/x86_64-unknown-linux-gnu/debug/build/iroh-base/b3405f0d82062f81/out -L dependency=/opt/rustwide/target/x86_64-unknown-linux-gnu/debug/build/iroh-dns/1284e63acbdfbf26/out -L dependency=/opt/rustwide/target/x86_64-unknown-linux-gnu/debug/build/iroh-io/c9566424cdc6ad6a/out -L dependency=/opt/rustwide/target/x86_64-unknown-linux-gnu/debug/build/iroh-metrics/214a964d98d8957a/out -L dependency=/opt/rustwide/target/x86_64-unknown-linux-gnu/debug/build/iroh-relay/f6ea780a92f32d43/out -L dependency=/opt/rustwide/target/x86_64-unknown-linux-gnu/debug/build/iroh/59692901f2c42a49/out -L dependency=/opt/rustwide/target/x86_64-unknown-linux-gnu/debug/build/itoa/c7dfb0c4cf55b511/out -L dependency=/opt/rustwide/target/x86_64-unknown-linux-gnu/debug/build/libc/2eee126b2dd8b848/out -L dependency=/opt/rustwide/target/x86_64-unknown-linux-gnu/debug/build/libm/a615231ddb18d19d/out -L dependency=/opt/rustwide/target/x86_64-unknown-linux-gnu/debug/build/linux-raw-sys/56287fb4cd2f1b0a/out -L dependency=/opt/rustwide/target/x86_64-unknown-linux-gnu/debug/build/litemap/6950ecd26e84d74f/out -L dependency=/opt/rustwide/target/x86_64-unknown-linux-gnu/debug/build/lock_api/74b6d469d28e7fb8/out -L dependency=/opt/rustwide/target/x86_64-unknown-linux-gnu/debug/build/log/581a5414c584e6cc/out -L dependency=/opt/rustwide/target/x86_64-unknown-linux-gnu/debug/build/lru-slab/ee0611f3e007e89f/out -L dependency=/opt/rustwide/target/x86_64-unknown-linux-gnu/debug/build/lru/6303bd914941668c/out -L dependency=/opt/rustwide/target/x86_64-unknown-linux-gnu/debug/build/mac-addr/ea272d9190c6d711/out -L dependency=/opt/rustwide/target/x86_64-unknown-linux-gnu/debug/build/memchr/56f4b3c6fe372526/out -L dependency=/opt/rustwide/target/x86_64-unknown-linux-gnu/debug/build/mio/55c6b79677daa1e5/out -L dependency=/opt/rustwide/target/x86_64-unknown-linux-gnu/debug/build/n0-dns-resolver/112f00af7d2cf0cc/out -L dependency=/opt/rustwide/target/x86_64-unknown-linux-gnu/debug/build/n0-error/14e3b420b5e61b33/out -L dependency=/opt/rustwide/target/x86_64-unknown-linux-gnu/debug/build/n0-future/ee4c9dbc37b6c8f6/out -L dependency=/opt/rustwide/target/x86_64-unknown-linux-gnu/debug/build/n0-watcher/da4777cc8a6f29b3/out -L dependency=/opt/rustwide/target/x86_64-unknown-linux-gnu/debug/build/netdev/d493b0bce25b79b3/out -L dependency=/opt/rustwide/target/x86_64-unknown-linux-gnu/debug/build/netlink-packet-core/c89453f30f8c2622/out -L dependency=/opt/rustwide/target/x86_64-unknown-linux-gnu/debug/build/netlink-packet-core/cea3b31bbc1dcd98/out -L dependency=/opt/rustwide/target/x86_64-unknown-linux-gnu/debug/build/netlink-packet-route/99e7f4c29fe2032a/out -L dependency=/opt/rustwide/target/x86_64-unknown-linux-gnu/debug/build/netlink-packet-route/be3400befeaf7a72/out -L dependency=/opt/rustwide/target/x86_64-unknown-linux-gnu/debug/build/netlink-proto/6acff4e1d2a9eaa2/out -L dependency=/opt/rustwide/target/x86_64-unknown-linux-gnu/debug/build/netlink-sys/b0d7b5f0431d91a1/out -L dependency=/opt/rustwide/target/x86_64-unknown-linux-gnu/debug/build/netlink-sys/e2dcfbbd16f7d726/out -L dependency=/opt/rustwide/target/x86_64-unknown-linux-gnu/debug/build/netwatch/bc403add342e99b8/out -L dependency=/opt/rustwide/target/x86_64-unknown-linux-gnu/debug/build/noq-proto/e395eb49c2eef85f/out -L dependency=/opt/rustwide/target/x86_64-unknown-linux-gnu/debug/build/noq-udp/02dcf9192a3802cf/out -L dependency=/opt/rustwide/target/x86_64-unknown-linux-gnu/debug/build/noq/55fac6c431893584/out -L dependency=/opt/rustwide/target/x86_64-unknown-linux-gnu/debug/build/num-conv/31ae0e227ddb2751/out -L dependency=/opt/rustwide/target/x86_64-unknown-linux-gnu/debug/build/num-traits/2314b30ae716ddb8/out -L dependency=/opt/rustwide/target/x86_64-unknown-linux-gnu/debug/build/num_enum/5dc9d9a235e96535/out -L dependency=/opt/rustwide/target/x86_64-unknown-linux-gnu/debug/build/once_cell/99dfa8c2adc0e264/out -L dependency=/opt/rustwide/target/x86_64-unknown-linux-gnu/debug/build/opaque-debug/2dca9aece6027530/out -L dependency=/opt/rustwide/target/x86_64-unknown-linux-gnu/debug/build/openssl-probe/579c38e5569400ad/out -L dependency=/opt/rustwide/target/x86_64-unknown-linux-gnu/debug/build/papaya/c075303398809d87/out -L dependency=/opt/rustwide/target/x86_64-unknown-linux-gnu/debug/build/parking/09206e406a740ceb/out -L dependency=/opt/rustwide/target/x86_64-unknown-linux-gnu/debug/build/parking_lot/85494084a2027a38/out -L dependency=/opt/rustwide/target/x86_64-unknown-linux-gnu/debug/build/parking_lot_core/1df19293526ba1c5/out -L dependency=/opt/rustwide/target/x86_64-unknown-linux-gnu/debug/build/pem-rfc7468/cfba1e45fbbf6b5f/out -L dependency=/opt/rustwide/target/x86_64-unknown-linux-gnu/debug/build/pem/b7c19774900f8af1/out -L dependency=/opt/rustwide/target/x86_64-unknown-linux-gnu/debug/build/percent-encoding/8ee2a12faa4bea7c/out -L dependency=/opt/rustwide/target/x86_64-unknown-linux-gnu/debug/build/pin-project-lite/bc47108c5d8f25ae/out -L dependency=/opt/rustwide/target/x86_64-unknown-linux-gnu/debug/build/pin-project/13c6d531cd3f9c7d/out -L dependency=/opt/rustwide/target/x86_64-unknown-linux-gnu/debug/build/pkcs8/26d6fd1160d4a0cf/out -L dependency=/opt/rustwide/target/x86_64-unknown-linux-gnu/debug/build/polyval/b403fa837ff5864e/out -L dependency=/opt/rustwide/target/x86_64-unknown-linux-gnu/debug/build/portable-atomic/c4c0a99083099231/out -L dependency=/opt/rustwide/target/x86_64-unknown-linux-gnu/debug/build/portmapper/2f5284da1e3dca74/out -L dependency=/opt/rustwide/target/x86_64-unknown-linux-gnu/debug/build/positioned-io/b9c32c52b41d0a2e/out -L dependency=/opt/rustwide/target/x86_64-unknown-linux-gnu/debug/build/postcard/23685a252f4b59ae/out -L dependency=/opt/rustwide/target/x86_64-unknown-linux-gnu/debug/build/potential_utf/3302a60756c62a47/out -L dependency=/opt/rustwide/target/x86_64-unknown-linux-gnu/debug/build/powerfmt/be1ccbb9deb5e01d/out -L dependency=/opt/rustwide/target/x86_64-unknown-linux-gnu/debug/build/rand/cb05d94fd300832d/out -L dependency=/opt/rustwide/target/x86_64-unknown-linux-gnu/debug/build/rand_core/b428739067e0dffa/out -L dependency=/opt/rustwide/target/x86_64-unknown-linux-gnu/debug/build/rand_pcg/310e45add3999900/out -L dependency=/opt/rustwide/target/x86_64-unknown-linux-gnu/debug/build/range-collections/60ef12ad8b7a0694/out -L dependency=/opt/rustwide/target/x86_64-unknown-linux-gnu/debug/build/rcgen/71a06a34bc94f0cf/out -L dependency=/opt/rustwide/target/x86_64-unknown-linux-gnu/debug/build/ref-cast/760960873630993d/out -L dependency=/opt/rustwide/target/x86_64-unknown-linux-gnu/debug/build/reqwest/cba4f07ace0c089c/out -L dependency=/opt/rustwide/target/x86_64-unknown-linux-gnu/debug/build/ring/cd3c2ff59f56f6fb/out -L dependency=/opt/rustwide/target/x86_64-unknown-linux-gnu/debug/build/rustc-hash/0c8827cc88ac4f78/out -L dependency=/opt/rustwide/target/x86_64-unknown-linux-gnu/debug/build/rustix/590cb249328e5b51/out -L dependency=/opt/rustwide/target/x86_64-unknown-linux-gnu/debug/build/rustls-native-certs/e1a470b29f99f1cb/out -L dependency=/opt/rustwide/target/x86_64-unknown-linux-gnu/debug/build/rustls-pki-types/c37ce8db3f4fea8d/out -L dependency=/opt/rustwide/target/x86_64-unknown-linux-gnu/debug/build/rustls-platform-verifier/36629049340c0ab6/out -L dependency=/opt/rustwide/target/x86_64-unknown-linux-gnu/debug/build/rustls-webpki/37efc62ef97de29f/out -L dependency=/opt/rustwide/target/x86_64-unknown-linux-gnu/debug/build/rustls/16b9cd8b761bbc47/out -L dependency=/opt/rustwide/target/x86_64-unknown-linux-gnu/debug/build/ryu/0ab78070e7f1387c/out -L dependency=/opt/rustwide/target/x86_64-unknown-linux-gnu/debug/build/scopeguard/cb69a910c37095f0/out -L dependency=/opt/rustwide/target/x86_64-unknown-linux-gnu/debug/build/seize/d3deef878486cc41/out -L dependency=/opt/rustwide/target/x86_64-unknown-linux-gnu/debug/build/self_cell/f386b1621cb7e4bd/out -L dependency=/opt/rustwide/target/x86_64-unknown-linux-gnu/debug/build/serde/aea43131a03528fe/out -L dependency=/opt/rustwide/target/x86_64-unknown-linux-gnu/debug/build/serde_bytes/73f9074a6adaa656/out -L dependency=/opt/rustwide/target/x86_64-unknown-linux-gnu/debug/build/serde_core/fe9fd367ae2cbc2b/out -L dependency=/opt/rustwide/target/x86_64-unknown-linux-gnu/debug/build/serde_json/8cdefa99b7b54856/out -L dependency=/opt/rustwide/target/x86_64-unknown-linux-gnu/debug/build/serdect/bafc7885e85f8b87/out -L dependency=/opt/rustwide/target/x86_64-unknown-linux-gnu/debug/build/sha1_smol/0faf3c2b9f99d3d6/out -L dependency=/opt/rustwide/target/x86_64-unknown-linux-gnu/debug/build/sha2/c4a1768e4393e41e/out -L dependency=/opt/rustwide/target/x86_64-unknown-linux-gnu/debug/build/signal-hook-registry/f3c62b5d672fe1de/out -L dependency=/opt/rustwide/target/x86_64-unknown-linux-gnu/debug/build/signature/422ee31e7a71ad34/out -L dependency=/opt/rustwide/target/x86_64-unknown-linux-gnu/debug/build/simdutf8/704fe1bbeec62a1f/out -L dependency=/opt/rustwide/target/x86_64-unknown-linux-gnu/debug/build/simple-dns/c5e3c4c75ccae1e7/out -L dependency=/opt/rustwide/target/x86_64-unknown-linux-gnu/debug/build/siphasher/da44cfdd0d5f891d/out -L dependency=/opt/rustwide/target/x86_64-unknown-linux-gnu/debug/build/slab/514469061b8e15e7/out -L dependency=/opt/rustwide/target/x86_64-unknown-linux-gnu/debug/build/smallvec/54726509d2c0010b/out -L dependency=/opt/rustwide/target/x86_64-unknown-linux-gnu/debug/build/socket2/f5f846406d4550c2/out -L dependency=/opt/rustwide/target/x86_64-unknown-linux-gnu/debug/build/sorted-index-buffer/35c6627c8802c08d/out -L dependency=/opt/rustwide/target/x86_64-unknown-linux-gnu/debug/build/spin/44809ae8faf91132/out -L dependency=/opt/rustwide/target/x86_64-unknown-linux-gnu/debug/build/spin/624f3f4f573a3c83/out -L dependency=/opt/rustwide/target/x86_64-unknown-linux-gnu/debug/build/spki/c27ae13fc1c0bdd9/out -L dependency=/opt/rustwide/target/x86_64-unknown-linux-gnu/debug/build/stable_deref_trait/cc29e2eb4af995bb/out -L dependency=/opt/rustwide/target/x86_64-unknown-linux-gnu/debug/build/strum/8d6334e2a5873b46/out -L dependency=/opt/rustwide/target/x86_64-unknown-linux-gnu/debug/build/subtle/c41cb393c7692340/out -L dependency=/opt/rustwide/target/x86_64-unknown-linux-gnu/debug/build/sync_wrapper/12215b6d832316e4/out -L dependency=/opt/rustwide/target/x86_64-unknown-linux-gnu/debug/build/thiserror/7cd77a027f5f7226/out -L dependency=/opt/rustwide/target/x86_64-unknown-linux-gnu/debug/build/time-core/49be3c2b76f1f91d/out -L dependency=/opt/rustwide/target/x86_64-unknown-linux-gnu/debug/build/time/08f1774acbee2693/out -L dependency=/opt/rustwide/target/x86_64-unknown-linux-gnu/debug/build/tinystr/3e07f5038d9db2ee/out -L dependency=/opt/rustwide/target/x86_64-unknown-linux-gnu/debug/build/tinyvec/65be470e6c06cde5/out -L dependency=/opt/rustwide/target/x86_64-unknown-linux-gnu/debug/build/tokio-rustls/9a52f09271ed3b39/out -L dependency=/opt/rustwide/target/x86_64-unknown-linux-gnu/debug/build/tokio-stream/b6c7b1b3cc9e8be8/out -L dependency=/opt/rustwide/target/x86_64-unknown-linux-gnu/debug/build/tokio-util/adf2f7d0dc456407/out -L dependency=/opt/rustwide/target/x86_64-unknown-linux-gnu/debug/build/tokio-websockets/25e16d188af96f91/out -L dependency=/opt/rustwide/target/x86_64-unknown-linux-gnu/debug/build/tokio/b63bdf2e8db48d84/out -L dependency=/opt/rustwide/target/x86_64-unknown-linux-gnu/debug/build/tower-http/d53335c048d24de3/out -L dependency=/opt/rustwide/target/x86_64-unknown-linux-gnu/debug/build/tower-layer/f80f0a0cfa5e2d11/out -L dependency=/opt/rustwide/target/x86_64-unknown-linux-gnu/debug/build/tower-service/415a761b7ca3059d/out -L dependency=/opt/rustwide/target/x86_64-unknown-linux-gnu/debug/build/tower/f160d8e8a4b7c72f/out -L dependency=/opt/rustwide/target/x86_64-unknown-linux-gnu/debug/build/tracing-core/f84c62a05ff5e545/out -L dependency=/opt/rustwide/target/x86_64-unknown-linux-gnu/debug/build/tracing/acbcb1b1ce5e746b/out -L dependency=/opt/rustwide/target/x86_64-unknown-linux-gnu/debug/build/try-lock/04e7f12c80193707/out -L dependency=/opt/rustwide/target/x86_64-unknown-linux-gnu/debug/build/typenum/2beadf215648d917/out -L dependency=/opt/rustwide/target/x86_64-unknown-linux-gnu/debug/build/universal-hash/6788f544c6d5e8a3/out -L dependency=/opt/rustwide/target/x86_64-unknown-linux-gnu/debug/build/untrusted/f6c5f8f27801f358/out -L dependency=/opt/rustwide/target/x86_64-unknown-linux-gnu/debug/build/url/04777652d37f20f4/out -L dependency=/opt/rustwide/target/x86_64-unknown-linux-gnu/debug/build/utf8_iter/3a94834afadbc640/out -L dependency=/opt/rustwide/target/x86_64-unknown-linux-gnu/debug/build/want/99941ac8680c0356/out -L dependency=/opt/rustwide/target/x86_64-unknown-linux-gnu/debug/build/webpki-roots/221adc7ca421a873/out -L dependency=/opt/rustwide/target/x86_64-unknown-linux-gnu/debug/build/writeable/e05c6b00d7ca546b/out -L dependency=/opt/rustwide/target/x86_64-unknown-linux-gnu/debug/build/xml-rs/387097f123fab703/out -L dependency=/opt/rustwide/target/x86_64-unknown-linux-gnu/debug/build/xmltree/816b85526469f3f5/out -L dependency=/opt/rustwide/target/x86_64-unknown-linux-gnu/debug/build/yasna/187fc0824fd4f34b/out -L dependency=/opt/rustwide/target/x86_64-unknown-linux-gnu/debug/build/yoke/9802088cb4b5c975/out -L dependency=/opt/rustwide/target/x86_64-unknown-linux-gnu/debug/build/zerocopy/a99114310b8b8be7/out -L dependency=/opt/rustwide/target/x86_64-unknown-linux-gnu/debug/build/zerofrom/e1054ba370332aad/out -L dependency=/opt/rustwide/target/x86_64-unknown-linux-gnu/debug/build/zeroize/e28dc484d4cb2dbd/out -L dependency=/opt/rustwide/target/x86_64-unknown-linux-gnu/debug/build/zerotrie/3c043a8668a65548/out -L dependency=/opt/rustwide/target/x86_64-unknown-linux-gnu/debug/build/zerovec/f17f3d2e28108b2c/out -L dependency=/opt/rustwide/target/x86_64-unknown-linux-gnu/debug/build/zmij/af95491124e15c46/out -L dependency=/opt/rustwide/target/debug/build/iroh-blobs/9725435dff648db4/out --extern arrayvec=/opt/rustwide/target/x86_64-unknown-linux-gnu/debug/build/arrayvec/9f21e2a39592551c/out/libarrayvec-9f21e2a39592551c.rmeta --extern bao_tree=/opt/rustwide/target/x86_64-unknown-linux-gnu/debug/build/bao-tree/e6143262b3ace1c4/out/libbao_tree-e6143262b3ace1c4.rmeta --extern bytes=/opt/rustwide/target/x86_64-unknown-linux-gnu/debug/build/bytes/7abdbe8174aca953/out/libbytes-7abdbe8174aca953.rmeta --extern chrono=/opt/rustwide/target/x86_64-unknown-linux-gnu/debug/build/chrono/0e002a9f204c20be/out/libchrono-0e002a9f204c20be.rmeta --extern constant_time_eq=/opt/rustwide/target/x86_64-unknown-linux-gnu/debug/build/constant_time_eq/55dc0f72bc989d95/out/libconstant_time_eq-55dc0f72bc989d95.rmeta --extern data_encoding=/opt/rustwide/target/x86_64-unknown-linux-gnu/debug/build/data-encoding/a04a226ffa91c805/out/libdata_encoding-a04a226ffa91c805.rmeta --extern derive_more=/opt/rustwide/target/x86_64-unknown-linux-gnu/debug/build/derive_more/75a6c1ef2a82157e/out/libderive_more-75a6c1ef2a82157e.rmeta --extern genawaiter=/opt/rustwide/target/x86_64-unknown-linux-gnu/debug/build/genawaiter/de4b993918d3de1f/out/libgenawaiter-de4b993918d3de1f.rmeta --extern hex=/opt/rustwide/target/x86_64-unknown-linux-gnu/debug/build/hex/44f3b3add99d6f16/out/libhex-44f3b3add99d6f16.rmeta --extern iroh=/opt/rustwide/target/x86_64-unknown-linux-gnu/debug/build/iroh/59692901f2c42a49/out/libiroh-59692901f2c42a49.rmeta --extern iroh_base=/opt/rustwide/target/x86_64-unknown-linux-gnu/debug/build/iroh-base/b3405f0d82062f81/out/libiroh_base-b3405f0d82062f81.rmeta --extern iroh_io=/opt/rustwide/target/x86_64-unknown-linux-gnu/debug/build/iroh-io/c9566424cdc6ad6a/out/libiroh_io-c9566424cdc6ad6a.rmeta --extern iroh_metrics=/opt/rustwide/target/x86_64-unknown-linux-gnu/debug/build/iroh-metrics/214a964d98d8957a/out/libiroh_metrics-214a964d98d8957a.rmeta --extern iroh_tickets=/opt/rustwide/target/x86_64-unknown-linux-gnu/debug/build/iroh-tickets/3d8d6187a1a8c843/out/libiroh_tickets-3d8d6187a1a8c843.rmeta --extern iroh_util=/opt/rustwide/target/x86_64-unknown-linux-gnu/debug/build/iroh-util/810a3e313d562269/out/libiroh_util-810a3e313d562269.rmeta --extern irpc=/opt/rustwide/target/x86_64-unknown-linux-gnu/debug/build/irpc/5c563c71e44f000a/out/libirpc-5c563c71e44f000a.rmeta --extern n0_error=/opt/rustwide/target/x86_64-unknown-linux-gnu/debug/build/n0-error/14e3b420b5e61b33/out/libn0_error-14e3b420b5e61b33.rmeta --extern n0_future=/opt/rustwide/target/x86_64-unknown-linux-gnu/debug/build/n0-future/ee4c9dbc37b6c8f6/out/libn0_future-ee4c9dbc37b6c8f6.rmeta --extern nested_enum_utils=/opt/rustwide/target/debug/build/nested_enum_utils/d017df9e0ca3e3e9/out/libnested_enum_utils-d017df9e0ca3e3e9.so --extern noq=/opt/rustwide/target/x86_64-unknown-linux-gnu/debug/build/noq/55fac6c431893584/out/libnoq-55fac6c431893584.rmeta --extern postcard=/opt/rustwide/target/x86_64-unknown-linux-gnu/debug/build/postcard/23685a252f4b59ae/out/libpostcard-23685a252f4b59ae.rmeta --extern rand=/opt/rustwide/target/x86_64-unknown-linux-gnu/debug/build/rand/cb05d94fd300832d/out/librand-cb05d94fd300832d.rmeta --extern range_collections=/opt/rustwide/target/x86_64-unknown-linux-gnu/debug/build/range-collections/60ef12ad8b7a0694/out/librange_collections-60ef12ad8b7a0694.rmeta --extern redb=/opt/rustwide/target/x86_64-unknown-linux-gnu/debug/build/redb/bce14a9a7e3ce20c/out/libredb-bce14a9a7e3ce20c.rmeta --extern ref_cast=/opt/rustwide/target/x86_64-unknown-linux-gnu/debug/build/ref-cast/760960873630993d/out/libref_cast-760960873630993d.rmeta --extern reflink_copy=/opt/rustwide/target/x86_64-unknown-linux-gnu/debug/build/reflink-copy/8fba11dcef0bfb51/out/libreflink_copy-8fba11dcef0bfb51.rmeta --extern self_cell=/opt/rustwide/target/x86_64-unknown-linux-gnu/debug/build/self_cell/f386b1621cb7e4bd/out/libself_cell-f386b1621cb7e4bd.rmeta --extern serde=/opt/rustwide/target/x86_64-unknown-linux-gnu/debug/build/serde/aea43131a03528fe/out/libserde-aea43131a03528fe.rmeta --extern smallvec=/opt/rustwide/target/x86_64-unknown-linux-gnu/debug/build/smallvec/54726509d2c0010b/out/libsmallvec-54726509d2c0010b.rmeta --extern tokio=/opt/rustwide/target/x86_64-unknown-linux-gnu/debug/build/tokio/b63bdf2e8db48d84/out/libtokio-b63bdf2e8db48d84.rmeta --extern tracing=/opt/rustwide/target/x86_64-unknown-linux-gnu/debug/build/tracing/acbcb1b1ce5e746b/out/libtracing-acbcb1b1ce5e746b.rmeta --cap-lints allow --force-warn=unused_crate_dependencies -L native=/opt/rustwide/target/x86_64-unknown-linux-gnu/debug/build/blake3/a8abf3c2e3bbe681/out -L native=/opt/rustwide/target/x86_64-unknown-linux-gnu/debug/build/blake3/a8abf3c2e3bbe681/out -L native=/opt/rustwide/target/x86_64-unknown-linux-gnu/debug/build/aws-lc-sys/b5bc0f4f395b8ae8/out -L native=/opt/rustwide/target/x86_64-unknown-linux-gnu/debug/build/ring/23d4c39807bead7f/out --check-cfg 'cfg(wasm_browser)'` (exit status: 101) [INFO] running `"docker" "inspect" "96b60c52d4cd1a2c5a637e1e92af959acf0dbf3ae27bbeb5448b63392ebcab88"`