Build failed. If you want to re-trigger a documentation build, you can do it here. You can find more information on docs.rs builds documentation on the builds page.
# error kind ExecutionFailed
# pre-build errors command failed: exit status: 101
# rustc version rustc 1.99.0-nightly (7608eb7b0 2026-08-05)
# docs.rs version docsrs 0.0.0 (c0e43eba3fa5e6341d933cf845300a19b1ac3e4e 2026-08-06 )
# build log [INFO] running `Command { std: "docker" "exec" "-e" "SOURCE_DIR=/opt/rustwide/workdir" "-e" "CARGO_HOME=/opt/rustwide/cargo-home" "-e" "RUSTUP_HOME=/opt/rustwide/rustup-home" "-e" "CARGO_TARGET_DIR=/opt/rustwide/target" "-e" "DOCS_RS=1" "-w" "/opt/rustwide/workdir" "--user" "1001:1001" "fbfa94d17a059616b7c622c730c524fcc4075a4511f95176e7bb7ed8abeae163" "/opt/rustwide/cargo-home/bin/cargo" "+nightly" "rustdoc" "--lib" "-Zrustdoc-map" "--config" "build.rustdocflags=[\"--cfg\", \"docsrs\", \"-Z\", \"unstable-options\", \"--emit=html-non-static-files\", \"--resource-suffix\", \"-20260805-1.99.0-nightly-7608eb7b0\", \"--static-root-path\", \"/-/rustdoc.static/\", \"--cap-lints\", \"warn\", \"--extern-html-root-takes-precedence\"]" "--offline" "-Zunstable-options" "--config=doc.extern-map.registries.crates-io=\"https://docs.rs/{pkg_name}/{version}/x86_64-unknown-linux-gnu\"" "-Zrustdoc-scrape-examples" "-j6" "--target" "x86_64-unknown-linux-gnu", kill_on_drop: false }` [INFO] [stderr] warning: target filter specified, but no targets matched; this is a no-op [INFO] [stderr] Compiling cairo-lang-sierra v2.20.0 [INFO] [stderr] Checking size-of v0.1.5 [INFO] [stderr] Checking good_lp v1.15.3 [INFO] [stderr] error[E0570]: "aapcs" is not a supported ABI for the current target [INFO] [stderr] --> /opt/rustwide/cargo-home/registry/src/index.crates.io-1949cf8c6b5b557f/size-of-0.1.5/src/macros.rs:66:56 [INFO] [stderr] | [INFO] [stderr] 66 | impl<$($ty,)* U> $crate::SizeOf for extern $cconv fn($($ty),*) -> U { [INFO] [stderr] | ^^^^^^ [INFO] [stderr] | [INFO] [stderr] ::: /opt/rustwide/cargo-home/registry/src/index.crates.io-1949cf8c6b5b557f/size-of-0.1.5/src/core_impls.rs:294:1 [INFO] [stderr] | [INFO] [stderr] 294 | / impl_function_ptrs! { [INFO] [stderr] 295 | | "C", [INFO] [stderr] 296 | | "Rust", [INFO] [stderr] 297 | | "aapcs", [INFO] [stderr] ... | [INFO] [stderr] 303 | | "fastcall", [INFO] [stderr] 304 | | } [INFO] [stderr] | |_- in this macro invocation [INFO] [stderr] | [INFO] [stderr] = note: this error originates in the macro `impl_function_ptrs` (in Nightly builds, run with -Z macro-backtrace for more info) [INFO] [stderr] [INFO] [stderr] error[E0570]: "stdcall" is not a supported ABI for the current target [INFO] [stderr] --> /opt/rustwide/cargo-home/registry/src/index.crates.io-1949cf8c6b5b557f/size-of-0.1.5/src/macros.rs:66:56 [INFO] [stderr] | [INFO] [stderr] 66 | impl<$($ty,)* U> $crate::SizeOf for extern $cconv fn($($ty),*) -> U { [INFO] [stderr] | ^^^^^^ [INFO] [stderr] | [INFO] [stderr] ::: /opt/rustwide/cargo-home/registry/src/index.crates.io-1949cf8c6b5b557f/size-of-0.1.5/src/core_impls.rs:294:1 [INFO] [stderr] | [INFO] [stderr] 294 | / impl_function_ptrs! { [INFO] [stderr] 295 | | "C", [INFO] [stderr] 296 | | "Rust", [INFO] [stderr] 297 | | "aapcs", [INFO] [stderr] ... | [INFO] [stderr] 303 | | "fastcall", [INFO] [stderr] 304 | | } [INFO] [stderr] | |_- in this macro invocation [INFO] [stderr] | [INFO] [stderr] = help: if you need `extern "stdcall"` on win32 and `extern "C"` everywhere else, use `extern "system"` [INFO] [stderr] = note: this error originates in the macro `impl_function_ptrs` (in Nightly builds, run with -Z macro-backtrace for more info) [INFO] [stderr] [INFO] [stderr] error[E0570]: "fastcall" is not a supported ABI for the current target [INFO] [stderr] --> /opt/rustwide/cargo-home/registry/src/index.crates.io-1949cf8c6b5b557f/size-of-0.1.5/src/macros.rs:66:56 [INFO] [stderr] | [INFO] [stderr] 66 | impl<$($ty,)* U> $crate::SizeOf for extern $cconv fn($($ty),*) -> U { [INFO] [stderr] | ^^^^^^ [INFO] [stderr] | [INFO] [stderr] ::: /opt/rustwide/cargo-home/registry/src/index.crates.io-1949cf8c6b5b557f/size-of-0.1.5/src/core_impls.rs:294:1 [INFO] [stderr] | [INFO] [stderr] 294 | / impl_function_ptrs! { [INFO] [stderr] 295 | | "C", [INFO] [stderr] 296 | | "Rust", [INFO] [stderr] 297 | | "aapcs", [INFO] [stderr] ... | [INFO] [stderr] 303 | | "fastcall", [INFO] [stderr] 304 | | } [INFO] [stderr] | |_- in this macro invocation [INFO] [stderr] | [INFO] [stderr] = note: this error originates in the macro `impl_function_ptrs` (in Nightly builds, run with -Z macro-backtrace for more info) [INFO] [stderr] [INFO] [stderr] For more information about this error, try `rustc --explain E0570`. [INFO] [stderr] Checking cairo-lang-eq-solver v2.20.0 [INFO] [stderr] error: could not compile `size-of` (lib) due to 3 previous errors [INFO] [stderr] warning: build failed, waiting for other jobs to finish... [INFO] running `Command { std: "docker" "inspect" "fbfa94d17a059616b7c622c730c524fcc4075a4511f95176e7bb7ed8abeae163", kill_on_drop: false }`