cairo-native-runtime 0.2.9

The runtime for cairo-native.
Documentation

Build #2564221 2025-10-06 12:26:16

Build failed. If you want to re-trigger a documentation build, you can do it here. You can find more information on docs.rs builds documentation on the builds page.

# rustc version rustc 1.92.0-nightly (839222065 2025-10-05)

# docs.rs version docsrs 0.6.0 (f42173de 2025-09-12)

# build log [INFO] running `Command { std: "docker" "create" "-v" "/home/cratesfyi/workspace-builder/builds/cairo-native-runtime-0.2.9/target:/opt/rustwide/target:rw,Z" "-v" "/home/cratesfyi/workspace-builder/builds/cairo-native-runtime-0.2.9/source:/opt/rustwide/workdir:ro,Z" "-v" "/home/cratesfyi/workspace-builder/cargo-home:/opt/rustwide/cargo-home:ro,Z" "-v" "/home/cratesfyi/workspace-builder/rustup-home:/opt/rustwide/rustup-home:ro,Z" "-e" "SOURCE_DIR=/opt/rustwide/workdir" "-e" "CARGO_TARGET_DIR=/opt/rustwide/target" "-e" "DOCS_RS=1" "-e" "CARGO_HOME=/opt/rustwide/cargo-home" "-e" "RUSTUP_HOME=/opt/rustwide/rustup-home" "-w" "/opt/rustwide/workdir" "-m" "6442450944" "--cpus" "6" "--user" "1001:1001" "--network" "none" "ghcr.io/rust-lang/crates-build-env/linux@sha256:e90291280db7d1fac5b66fc6dad9f9662629e7365a55743daf9bdf73ebc4ea79" "/opt/rustwide/cargo-home/bin/cargo" "+nightly" "rustdoc" "--lib" "-Zrustdoc-map" "--config" "build.rustdocflags=[\"--cfg\", \"docsrs\", \"-Z\", \"unstable-options\", \"--emit=invocation-specific\", \"--resource-suffix\", \"-20251005-1.92.0-nightly-839222065\", \"--static-root-path\", \"/-/rustdoc.static/\", \"--cap-lints\", \"warn\", \"--extern-html-root-takes-precedence\"]" "--offline" "-Zunstable-options" "--config=doc.extern-map.registries.crates-io=\"https://docs.rs/{pkg_name}/{version}/x86_64-unknown-linux-gnu\"" "-Zrustdoc-scrape-examples" "-j6" "--target" "x86_64-unknown-linux-gnu", kill_on_drop: false }` [INFO] [stderr] WARNING: Your kernel does not support swap limit capabilities or the cgroup is not mounted. Memory limited without swap. [INFO] [stdout] a38fb832098d139d1a798ef08217a8cb9acd427b88e89702a302090cdd7f00ab [INFO] running `Command { std: "docker" "start" "-a" "a38fb832098d139d1a798ef08217a8cb9acd427b88e89702a302090cdd7f00ab", kill_on_drop: false }` [INFO] [stderr] warning: target filter specified, but no targets matched; this is a no-op [INFO] [stderr] Compiling cairo-lang-sierra v2.12.3 [INFO] [stderr] Checking size-of v0.1.5 [INFO] [stderr] error[E0570]: "aapcs" is not a supported ABI for the current target [INFO] [stderr] --> /opt/rustwide/cargo-home/registry/src/index.crates.io-1949cf8c6b5b557f/size-of-0.1.5/src/macros.rs:66:56 [INFO] [stderr] | [INFO] [stderr] 66 | impl<$($ty,)* U> $crate::SizeOf for extern $cconv fn($($ty),*) -> U { [INFO] [stderr] | ^^^^^^ [INFO] [stderr] | [INFO] [stderr] ::: /opt/rustwide/cargo-home/registry/src/index.crates.io-1949cf8c6b5b557f/size-of-0.1.5/src/core_impls.rs:294:1 [INFO] [stderr] | [INFO] [stderr] 294 | / impl_function_ptrs! { [INFO] [stderr] 295 | | "C", [INFO] [stderr] 296 | | "Rust", [INFO] [stderr] 297 | | "aapcs", [INFO] [stderr] ... | [INFO] [stderr] 303 | | "fastcall", [INFO] [stderr] 304 | | } [INFO] [stderr] | |_- in this macro invocation [INFO] [stderr] | [INFO] [stderr] = note: this error originates in the macro `impl_function_ptrs` (in Nightly builds, run with -Z macro-backtrace for more info) [INFO] [stderr] [INFO] [stderr] error[E0570]: "stdcall" is not a supported ABI for the current target [INFO] [stderr] --> /opt/rustwide/cargo-home/registry/src/index.crates.io-1949cf8c6b5b557f/size-of-0.1.5/src/macros.rs:66:56 [INFO] [stderr] | [INFO] [stderr] 66 | impl<$($ty,)* U> $crate::SizeOf for extern $cconv fn($($ty),*) -> U { [INFO] [stderr] | ^^^^^^ [INFO] [stderr] | [INFO] [stderr] ::: /opt/rustwide/cargo-home/registry/src/index.crates.io-1949cf8c6b5b557f/size-of-0.1.5/src/core_impls.rs:294:1 [INFO] [stderr] | [INFO] [stderr] 294 | / impl_function_ptrs! { [INFO] [stderr] 295 | | "C", [INFO] [stderr] 296 | | "Rust", [INFO] [stderr] 297 | | "aapcs", [INFO] [stderr] ... | [INFO] [stderr] 303 | | "fastcall", [INFO] [stderr] 304 | | } [INFO] [stderr] | |_- in this macro invocation [INFO] [stderr] | [INFO] [stderr] = help: if you need `extern "stdcall"` on win32 and `extern "C"` everywhere else, use `extern "system"` [INFO] [stderr] = note: this error originates in the macro `impl_function_ptrs` (in Nightly builds, run with -Z macro-backtrace for more info) [INFO] [stderr] [INFO] [stderr] error[E0570]: "fastcall" is not a supported ABI for the current target [INFO] [stderr] --> /opt/rustwide/cargo-home/registry/src/index.crates.io-1949cf8c6b5b557f/size-of-0.1.5/src/macros.rs:66:56 [INFO] [stderr] | [INFO] [stderr] 66 | impl<$($ty,)* U> $crate::SizeOf for extern $cconv fn($($ty),*) -> U { [INFO] [stderr] | ^^^^^^ [INFO] [stderr] | [INFO] [stderr] ::: /opt/rustwide/cargo-home/registry/src/index.crates.io-1949cf8c6b5b557f/size-of-0.1.5/src/core_impls.rs:294:1 [INFO] [stderr] | [INFO] [stderr] 294 | / impl_function_ptrs! { [INFO] [stderr] 295 | | "C", [INFO] [stderr] 296 | | "Rust", [INFO] [stderr] 297 | | "aapcs", [INFO] [stderr] ... | [INFO] [stderr] 303 | | "fastcall", [INFO] [stderr] 304 | | } [INFO] [stderr] | |_- in this macro invocation [INFO] [stderr] | [INFO] [stderr] = note: this error originates in the macro `impl_function_ptrs` (in Nightly builds, run with -Z macro-backtrace for more info) [INFO] [stderr] [INFO] [stderr] For more information about this error, try `rustc --explain E0570`. [INFO] [stderr] error: could not compile `size-of` (lib) due to 3 previous errors [INFO] [stderr] warning: build failed, waiting for other jobs to finish... [INFO] running `Command { std: "docker" "inspect" "a38fb832098d139d1a798ef08217a8cb9acd427b88e89702a302090cdd7f00ab", kill_on_drop: false }` [INFO] running `Command { std: "docker" "rm" "-f" "a38fb832098d139d1a798ef08217a8cb9acd427b88e89702a302090cdd7f00ab", kill_on_drop: false }` [INFO] [stdout] a38fb832098d139d1a798ef08217a8cb9acd427b88e89702a302090cdd7f00ab