buildable 0.0.5

Buildable trait definition and utilities helpful in build lifecycles

Build #90209 2018-03-06 02:22:19

Build failed. If you want to re-trigger a documentation build, you can do it here. You can find more information on docs.rs builds documentation on the builds page.

# rustc version rustc 1.26.0-dev (5c1d29af0 2018-03-03)

# docs.rs version cratesfyi 0.5.0 (579f83b 2018-03-05)

# build log Updating registry `https://github.com/rust-lang/crates.io-index` Documenting buildable v0.0.5 Running `rustdoc --crate-name buildable .cargo/registry/src/github.com-1ecc6299db9ec823/buildable-0.0.5/src/lib.rs -o /home/cratesfyi/cratesfyi/doc -Z unstable-options --resource-suffix -20180303-1.26.0-dev-5c1d29af0 -L dependency=/home/cratesfyi/cratesfyi/debug/deps` error: cannot find derive macro `Show` in this scope --> .cargo/registry/src/github.com-1ecc6299db9ec823/buildable-0.0.5/src/lib.rs:214:47 | 214 | #[derive(Copy,PartialEq, Eq, PartialOrd, Ord, Show)] | ^^^^ error[E0412]: cannot find type `Path` in this scope --> .cargo/registry/src/github.com-1ecc6299db9ec823/buildable-0.0.5/src/lib.rs:23:17 | 23 | dir: Option<Path>, | ^^^^ not found in this scope help: possible candidate is found in another module, you can import it into scope | 13 | use std::path::Path; | error[E0412]: cannot find type `Path` in this scope --> .cargo/registry/src/github.com-1ecc6299db9ec823/buildable-0.0.5/src/lib.rs:69:32 | 69 | pub fn dir(&mut self, dir: Path) -> &mut BuildConfig { | ^^^^ not found in this scope help: possible candidate is found in another module, you can import it into scope | 13 | use std::path::Path; | error[E0412]: cannot find type `Path` in this scope --> .cargo/registry/src/github.com-1ecc6299db9ec823/buildable-0.0.5/src/lib.rs:155:41 | 155 | pub fn get_dir<'a>(&'a self) -> &'a Path { | ^^^^ not found in this scope help: possible candidate is found in another module, you can import it into scope | 13 | use std::path::Path; | error: aborting due to 4 previous errors If you want more information on this error, try using "rustc --explain E0412" thread 'main' panicked at 'Error( CargoError( ChainedError { error: Could not document `buildable`., cause: process didn't exit successfully: `rustdoc --crate-name buildable .cargo/registry/src/github.com-1ecc6299db9ec823/buildable-0.0.5/src/lib.rs -o /home/cratesfyi/cratesfyi/doc -Z unstable-options --resource-suffix -20180303-1.26.0-dev-5c1d29af0 -L dependency=/home/cratesfyi/cratesfyi/debug/deps` (exit code: 101) } ), State { next_error: None, backtrace: None } )', src/bin/cratesfyi.rs:142:13 note: Run with `RUST_BACKTRACE=1` for a backtrace.