Build failed. If you want to re-trigger a documentation build, you can do it here. You can find more information on docs.rs builds documentation on the builds page.
# error kind ExecutionFailed
# pre-build errors command failed: exit status: 101
# rustc version rustc 1.100.0-nightly (cea272fa3 2026-09-07)
# docs.rs version docsrs 0.0.0 (c6ca30c0fecf66cc5a0859ac541222ca6c912d59 2026-09-01 )
# build log [INFO] running `Command { std: "docker" "exec" "-e" "SOURCE_DIR=/opt/rustwide/workdir" "-e" "CARGO_HOME=/opt/rustwide/cargo-home" "-e" "RUSTUP_HOME=/opt/rustwide/rustup-home" "-e" "CARGO_TARGET_DIR=/opt/rustwide/target" "-e" "DOCS_RS=1" "-w" "/opt/rustwide/workdir" "--user" "1001:1001" "31ce521eb48e40925540388ddeb53c1dbd80438a8683db89847b3f6efc73a918" "/opt/rustwide/cargo-home/bin/cargo" "+nightly" "rustdoc" "--lib" "-Zrustdoc-map" "--config" "build.rustdocflags=[\"--cfg\", \"docsrs\", \"-Z\", \"unstable-options\", \"--emit=html-non-static-files\", \"--resource-suffix\", \"-20260907-1.100.0-nightly-cea272fa3\", \"--static-root-path\", \"/-/rustdoc.static/\", \"--cap-lints\", \"warn\", \"--extern-html-root-takes-precedence\"]" "--offline" "-Zunstable-options" "--config=doc.extern-map.registries.crates-io=\"https://docs.rs/{pkg_name}/{version}/x86_64-unknown-linux-gnu\"" "-j11" "--target" "x86_64-unknown-linux-gnu" "-Zrustdoc-scrape-examples", kill_on_drop: false }` [INFO] [stderr] warning: explicit `package.readme` can be inferred [INFO] [stderr] --> Cargo.toml:65:1 [INFO] [stderr] | [INFO] [stderr] 65 | readme = "README.md" [INFO] [stderr] | ^^^^^^^^^^^^^^^^^^^^ [INFO] [stderr] | [INFO] [stderr] = note: `cargo::manual_readme` is set to `warn` by default [INFO] [stderr] help: consider removing `package.readme` [INFO] [stderr] warning: `bevy_sqlx` (manifest) generated 1 warning [INFO] [stderr] warning: Rustdoc did not scrape the following examples because they require dev-dependencies: postgres-sync, sqlite-debug, sqlite-headless, sqlite-resource, sqlite-return, sqlite-sync [INFO] [stderr] If you want Rustdoc to scrape these examples, then add `doc-scrape-examples = true` [INFO] [stderr] to the [[example]] target configuration of at least one example. [INFO] [stderr] warning: target filter specified, but no targets matched; this is a no-op [INFO] [stderr] Documenting bevy_sqlx v0.1.9 (/opt/rustwide/workdir) [INFO] [stderr] error[E0425]: cannot find type `EventReader` in this scope [INFO] [stderr] --> src/event.rs:226:21 [INFO] [stderr] | [INFO] [stderr] 226 | mut events: EventReader<SqlxEvent<DB, C>>, [INFO] [stderr] | ^^^^^^^^^^^ not found in this scope [INFO] [stderr] [INFO] [stderr] error[E0425]: cannot find type `EventWriter` in this scope [INFO] [stderr] --> src/event.rs:227:21 [INFO] [stderr] | [INFO] [stderr] 227 | mut status: EventWriter<SqlxEventStatus<DB, C>>, [INFO] [stderr] | ^^^^^^^^^^^ not found in this scope [INFO] [stderr] [INFO] [stderr] error[E0425]: cannot find type `EventWriter` in this scope [INFO] [stderr] --> src/tasks.rs:63:13 [INFO] [stderr] | [INFO] [stderr] 63 | EventWriter<SqlxEventStatus<DB, C>>, [INFO] [stderr] | ^^^^^^^^^^^ not found in this scope [INFO] [stderr] [INFO] [stderr] error[E0107]: associated type takes 0 lifetime arguments but 1 lifetime argument was supplied [INFO] [stderr] --> src/event.rs:74:37 [INFO] [stderr] | [INFO] [stderr] 74 | for<'a> <DB as sqlx::Database>::Arguments<'a>: IntoArguments<'a, DB>, [INFO] [stderr] | ^^^^^^^^^---- help: remove the unnecessary generics [INFO] [stderr] | | [INFO] [stderr] | expected 0 lifetime arguments [INFO] [stderr] | [INFO] [stderr] note: associated type defined here, with 0 lifetime parameters [INFO] [stderr] --> /opt/rustwide/cargo-home/registry/src/index.crates.io-1949cf8c6b5b557f/sqlx-core-0.9.0/src/database.rs:99:10 [INFO] [stderr] | [INFO] [stderr] 99 | type Arguments: Arguments<Database = Self>; [INFO] [stderr] | ^^^^^^^^^ [INFO] [stderr] [INFO] [stderr] error[E0107]: trait takes 0 lifetime arguments but 1 lifetime argument was supplied [INFO] [stderr] --> src/event.rs:74:52 [INFO] [stderr] | [INFO] [stderr] 74 | for<'a> <DB as sqlx::Database>::Arguments<'a>: IntoArguments<'a, DB>, [INFO] [stderr] | ^^^^^^^^^^^^^ -- help: remove the lifetime argument [INFO] [stderr] | | [INFO] [stderr] | expected 0 lifetime arguments [INFO] [stderr] | [INFO] [stderr] note: trait defined here, with 0 lifetime parameters [INFO] [stderr] --> /opt/rustwide/cargo-home/registry/src/index.crates.io-1949cf8c6b5b557f/sqlx-core-0.9.0/src/arguments.rs:32:11 [INFO] [stderr] | [INFO] [stderr] 32 | pub trait IntoArguments<DB: Database>: Sized + Send { [INFO] [stderr] | ^^^^^^^^^^^^^ [INFO] [stderr] [INFO] [stderr] error[E0107]: associated type takes 0 lifetime arguments but 1 lifetime argument was supplied [INFO] [stderr] --> src/event.rs:215:31 [INFO] [stderr] | [INFO] [stderr] 215 | for<'q> <DB as Database>::Arguments<'q>: IntoArguments<'q, DB>, [INFO] [stderr] | ^^^^^^^^^---- help: remove the unnecessary generics [INFO] [stderr] | | [INFO] [stderr] | expected 0 lifetime arguments [INFO] [stderr] | [INFO] [stderr] note: associated type defined here, with 0 lifetime parameters [INFO] [stderr] --> /opt/rustwide/cargo-home/registry/src/index.crates.io-1949cf8c6b5b557f/sqlx-core-0.9.0/src/database.rs:99:10 [INFO] [stderr] | [INFO] [stderr] 99 | type Arguments: Arguments<Database = Self>; [INFO] [stderr] | ^^^^^^^^^ [INFO] [stderr] [INFO] [stderr] error[E0107]: trait takes 0 lifetime arguments but 1 lifetime argument was supplied [INFO] [stderr] --> src/event.rs:215:46 [INFO] [stderr] | [INFO] [stderr] 215 | for<'q> <DB as Database>::Arguments<'q>: IntoArguments<'q, DB>, [INFO] [stderr] | ^^^^^^^^^^^^^ -- help: remove the lifetime argument [INFO] [stderr] | | [INFO] [stderr] | expected 0 lifetime arguments [INFO] [stderr] | [INFO] [stderr] note: trait defined here, with 0 lifetime parameters [INFO] [stderr] --> /opt/rustwide/cargo-home/registry/src/index.crates.io-1949cf8c6b5b557f/sqlx-core-0.9.0/src/arguments.rs:32:11 [INFO] [stderr] | [INFO] [stderr] 32 | pub trait IntoArguments<DB: Database>: Sized + Send { [INFO] [stderr] | ^^^^^^^^^^^^^ [INFO] [stderr] [INFO] [stderr] error[E0107]: associated type takes 0 lifetime arguments but 1 lifetime argument was supplied [INFO] [stderr] --> src/plugin.rs:59:31 [INFO] [stderr] | [INFO] [stderr] 59 | for<'q> <DB as Database>::Arguments<'q>: IntoArguments<'q, DB>, [INFO] [stderr] | ^^^^^^^^^---- help: remove the unnecessary generics [INFO] [stderr] | | [INFO] [stderr] | expected 0 lifetime arguments [INFO] [stderr] | [INFO] [stderr] note: associated type defined here, with 0 lifetime parameters [INFO] [stderr] --> /opt/rustwide/cargo-home/registry/src/index.crates.io-1949cf8c6b5b557f/sqlx-core-0.9.0/src/database.rs:99:10 [INFO] [stderr] | [INFO] [stderr] 99 | type Arguments: Arguments<Database = Self>; [INFO] [stderr] | ^^^^^^^^^ [INFO] [stderr] [INFO] [stderr] error[E0107]: trait takes 0 lifetime arguments but 1 lifetime argument was supplied [INFO] [stderr] --> src/plugin.rs:59:46 [INFO] [stderr] | [INFO] [stderr] 59 | for<'q> <DB as Database>::Arguments<'q>: IntoArguments<'q, DB>, [INFO] [stderr] | ^^^^^^^^^^^^^ -- help: remove the lifetime argument [INFO] [stderr] | | [INFO] [stderr] | expected 0 lifetime arguments [INFO] [stderr] | [INFO] [stderr] note: trait defined here, with 0 lifetime parameters [INFO] [stderr] --> /opt/rustwide/cargo-home/registry/src/index.crates.io-1949cf8c6b5b557f/sqlx-core-0.9.0/src/arguments.rs:32:11 [INFO] [stderr] | [INFO] [stderr] 32 | pub trait IntoArguments<DB: Database>: Sized + Send { [INFO] [stderr] | ^^^^^^^^^^^^^ [INFO] [stderr] [INFO] [stderr] error[E0107]: associated type takes 0 lifetime arguments but 1 lifetime argument was supplied [INFO] [stderr] --> src/tasks.rs:39:31 [INFO] [stderr] | [INFO] [stderr] 39 | for<'q> <DB as Database>::Arguments<'q>: IntoArguments<'q, DB>, [INFO] [stderr] | ^^^^^^^^^---- help: remove the unnecessary generics [INFO] [stderr] | | [INFO] [stderr] | expected 0 lifetime arguments [INFO] [stderr] | [INFO] [stderr] note: associated type defined here, with 0 lifetime parameters [INFO] [stderr] --> /opt/rustwide/cargo-home/registry/src/index.crates.io-1949cf8c6b5b557f/sqlx-core-0.9.0/src/database.rs:99:10 [INFO] [stderr] | [INFO] [stderr] 99 | type Arguments: Arguments<Database = Self>; [INFO] [stderr] | ^^^^^^^^^ [INFO] [stderr] [INFO] [stderr] error[E0107]: trait takes 0 lifetime arguments but 1 lifetime argument was supplied [INFO] [stderr] --> src/tasks.rs:39:46 [INFO] [stderr] | [INFO] [stderr] 39 | for<'q> <DB as Database>::Arguments<'q>: IntoArguments<'q, DB>, [INFO] [stderr] | ^^^^^^^^^^^^^ -- help: remove the lifetime argument [INFO] [stderr] | | [INFO] [stderr] | expected 0 lifetime arguments [INFO] [stderr] | [INFO] [stderr] note: trait defined here, with 0 lifetime parameters [INFO] [stderr] --> /opt/rustwide/cargo-home/registry/src/index.crates.io-1949cf8c6b5b557f/sqlx-core-0.9.0/src/arguments.rs:32:11 [INFO] [stderr] | [INFO] [stderr] 32 | pub trait IntoArguments<DB: Database>: Sized + Send { [INFO] [stderr] | ^^^^^^^^^^^^^ [INFO] [stderr] [INFO] [stderr] Some errors have detailed explanations: E0107, E0425. [INFO] [stderr] For more information about an error, try `rustc --explain E0107`. [INFO] [stderr] error: could not document `bevy_sqlx` [INFO] running `Command { std: "docker" "inspect" "31ce521eb48e40925540388ddeb53c1dbd80438a8683db89847b3f6efc73a918", kill_on_drop: false }`