bcode_config 0.0.1-alpha.0

Configuration loading for bcode

Build #4893203 2026-10-17 21:49:14

Build failed. If you want to re-trigger a documentation build, you can do it here. You can find more information on docs.rs builds documentation on the builds page.

# error kind ExecutionFailed

# pre-build errors command failed: exit status: 101

# rustc version rustc 1.101.0-nightly (5d8fec066 2026-10-16)

# docs.rs version docsrs 0.0.0 (4259a798bb58835b634f4d75c4481f2f17bdb1d5 2026-10-17 )

# build log [INFO] adding target x86_64-unknown-linux-gnu for toolchain nightly [INFO] running `"rustup" "target" "add" "--toolchain" "nightly" "x86_64-unknown-linux-gnu"` [INFO] [stderr] info: component rust-std is up to date [INFO] running `"docker" "exec" "-e" "SOURCE_DIR=/opt/rustwide/workdir" "-e" "CARGO_HOME=/opt/rustwide/cargo-home" "-e" "RUSTUP_HOME=/opt/rustwide/rustup-home" "-e" "CARGO_TARGET_DIR=/opt/rustwide/target" "-e" "DOCS_RS=1" "-w" "/opt/rustwide/workdir" "--user" "1001:1001" "ffb3522969fbb90b6430c5a30375bb4be62bdee82c7596c6d4029a63b81166cb" "/opt/rustwide/cargo-home/bin/cargo" "+nightly" "rustdoc" "--lib" "-Zrustdoc-map" "--config" "build.rustdocflags=[\"--cfg\", \"docsrs\", \"-Z\", \"unstable-options\", \"--emit=html-non-static-files\", \"--resource-suffix\", \"-20261016-1.101.0-nightly-5d8fec066\", \"--static-root-path\", \"/-/rustdoc.static/\", \"--extern-html-root-takes-precedence\"]" "--offline" "-Zunstable-options" "--config=doc.extern-map.registries.crates-io=\"https://docs.rs/{pkg_name}/{version}/x86_64-unknown-linux-gnu\"" "-j11" "--target" "x86_64-unknown-linux-gnu" "-Zrustdoc-scrape-examples"` [INFO] [stderr] warning: target filter specified, but no targets matched; this is a no-op [INFO] [stderr] Checking bcode_session_models v0.0.1-alpha.0 [INFO] [stderr] Checking bcode_agent_policy_models v0.0.1-alpha.0 [INFO] [stderr] error[E0433]: cannot find `Value` in `toml` [INFO] [stderr] --> /opt/rustwide/cargo-home/registry/src/index.crates.io-1949cf8c6b5b557f/bcode_agent_policy_models-0.0.1-alpha.0/src/lib.rs:25:72 [INFO] [stderr] | [INFO] [stderr] 25 | #[derive(Debug, Clone, Default, PartialEq, Eq, Serialize, Deserialize, ConfigDoc)] [INFO] [stderr] | ^^^^^^^^^ could not find `Value` in `toml` [INFO] [stderr] | [INFO] [stderr] note: found an item that was configured out [INFO] [stderr] --> /opt/rustwide/cargo-home/registry/src/index.crates.io-1949cf8c6b5b557f/toml-1.1.8+spec-1.1.0/src/lib.rs:191:23 [INFO] [stderr] | [INFO] [stderr] 190 | #[cfg(feature = "serde")] [INFO] [stderr] | ----------------- the item is gated behind the `serde` feature [INFO] [stderr] 191 | pub use crate::value::Value; [INFO] [stderr] | ^^^^^ [INFO] [stderr] = note: this error originates in the derive macro `ConfigDoc` (in Nightly builds, run with -Z macro-backtrace for more info) [INFO] [stderr] [INFO] [stderr] error[E0433]: cannot find `Value` in `toml` [INFO] [stderr] --> /opt/rustwide/cargo-home/registry/src/index.crates.io-1949cf8c6b5b557f/bcode_agent_policy_models-0.0.1-alpha.0/src/lib.rs:55:63 [INFO] [stderr] | [INFO] [stderr] 55 | #[derive(Debug, Clone, PartialEq, Eq, Serialize, Deserialize, ConfigDoc)] [INFO] [stderr] | ^^^^^^^^^ could not find `Value` in `toml` [INFO] [stderr] | [INFO] [stderr] note: found an item that was configured out [INFO] [stderr] --> /opt/rustwide/cargo-home/registry/src/index.crates.io-1949cf8c6b5b557f/toml-1.1.8+spec-1.1.0/src/lib.rs:191:23 [INFO] [stderr] | [INFO] [stderr] 190 | #[cfg(feature = "serde")] [INFO] [stderr] | ----------------- the item is gated behind the `serde` feature [INFO] [stderr] 191 | pub use crate::value::Value; [INFO] [stderr] | ^^^^^ [INFO] [stderr] = note: this error originates in the derive macro `ConfigDoc` (in Nightly builds, run with -Z macro-backtrace for more info) [INFO] [stderr] [INFO] [stderr] error[E0433]: cannot find `Value` in `toml` [INFO] [stderr] --> /opt/rustwide/cargo-home/registry/src/index.crates.io-1949cf8c6b5b557f/bcode_agent_policy_models-0.0.1-alpha.0/src/lib.rs:98:63 [INFO] [stderr] | [INFO] [stderr] 98 | #[derive(Debug, Clone, PartialEq, Eq, Serialize, Deserialize, ConfigDoc)] [INFO] [stderr] | ^^^^^^^^^ could not find `Value` in `toml` [INFO] [stderr] | [INFO] [stderr] note: found an item that was configured out [INFO] [stderr] --> /opt/rustwide/cargo-home/registry/src/index.crates.io-1949cf8c6b5b557f/toml-1.1.8+spec-1.1.0/src/lib.rs:191:23 [INFO] [stderr] | [INFO] [stderr] 190 | #[cfg(feature = "serde")] [INFO] [stderr] | ----------------- the item is gated behind the `serde` feature [INFO] [stderr] 191 | pub use crate::value::Value; [INFO] [stderr] | ^^^^^ [INFO] [stderr] = note: this error originates in the derive macro `ConfigDoc` (in Nightly builds, run with -Z macro-backtrace for more info) [INFO] [stderr] [INFO] [stderr] error[E0433]: cannot find `Value` in `toml` [INFO] [stderr] --> /opt/rustwide/cargo-home/registry/src/index.crates.io-1949cf8c6b5b557f/bcode_agent_policy_models-0.0.1-alpha.0/src/lib.rs:131:72 [INFO] [stderr] | [INFO] [stderr] 131 | #[derive(Debug, Clone, Default, PartialEq, Eq, Serialize, Deserialize, ConfigDoc)] [INFO] [stderr] | ^^^^^^^^^ could not find `Value` in `toml` [INFO] [stderr] | [INFO] [stderr] note: found an item that was configured out [INFO] [stderr] --> /opt/rustwide/cargo-home/registry/src/index.crates.io-1949cf8c6b5b557f/toml-1.1.8+spec-1.1.0/src/lib.rs:191:23 [INFO] [stderr] | [INFO] [stderr] 190 | #[cfg(feature = "serde")] [INFO] [stderr] | ----------------- the item is gated behind the `serde` feature [INFO] [stderr] 191 | pub use crate::value::Value; [INFO] [stderr] | ^^^^^ [INFO] [stderr] = note: this error originates in the derive macro `ConfigDoc` (in Nightly builds, run with -Z macro-backtrace for more info) [INFO] [stderr] [INFO] [stderr] error[E0433]: cannot find `Value` in `toml` [INFO] [stderr] --> /opt/rustwide/cargo-home/registry/src/index.crates.io-1949cf8c6b5b557f/bcode_agent_policy_models-0.0.1-alpha.0/src/lib.rs:167:72 [INFO] [stderr] | [INFO] [stderr] 167 | #[derive(Debug, Clone, Default, PartialEq, Eq, Serialize, Deserialize, ConfigDoc)] [INFO] [stderr] | ^^^^^^^^^ could not find `Value` in `toml` [INFO] [stderr] | [INFO] [stderr] note: found an item that was configured out [INFO] [stderr] --> /opt/rustwide/cargo-home/registry/src/index.crates.io-1949cf8c6b5b557f/toml-1.1.8+spec-1.1.0/src/lib.rs:191:23 [INFO] [stderr] | [INFO] [stderr] 190 | #[cfg(feature = "serde")] [INFO] [stderr] | ----------------- the item is gated behind the `serde` feature [INFO] [stderr] 191 | pub use crate::value::Value; [INFO] [stderr] | ^^^^^ [INFO] [stderr] = note: this error originates in the derive macro `ConfigDoc` (in Nightly builds, run with -Z macro-backtrace for more info) [INFO] [stderr] [INFO] [stderr] error[E0425]: cannot find function `to_string_pretty` in crate `toml` [INFO] [stderr] --> /opt/rustwide/cargo-home/registry/src/index.crates.io-1949cf8c6b5b557f/bcode_agent_policy_models-0.0.1-alpha.0/src/lib.rs:25:72 [INFO] [stderr] | [INFO] [stderr] 25 | #[derive(Debug, Clone, Default, PartialEq, Eq, Serialize, Deserialize, ConfigDoc)] [INFO] [stderr] | ^^^^^^^^^ not found in `toml` [INFO] [stderr] | [INFO] [stderr] note: found an item that was configured out [INFO] [stderr] --> /opt/rustwide/cargo-home/registry/src/index.crates.io-1949cf8c6b5b557f/toml-1.1.8+spec-1.1.0/src/lib.rs:188:45 [INFO] [stderr] | [INFO] [stderr] 187 | #[cfg(feature = "serde")] [INFO] [stderr] | ----------------- the item is gated behind the `serde` feature [INFO] [stderr] 188 | pub use crate::ser::{Serializer, to_string, to_string_pretty}; [INFO] [stderr] | ^^^^^^^^^^^^^^^^ [INFO] [stderr] = note: this error originates in the derive macro `ConfigDoc` (in Nightly builds, run with -Z macro-backtrace for more info) [INFO] [stderr] [INFO] [stderr] error[E0425]: cannot find function `to_string_pretty` in crate `toml` [INFO] [stderr] --> /opt/rustwide/cargo-home/registry/src/index.crates.io-1949cf8c6b5b557f/bcode_agent_policy_models-0.0.1-alpha.0/src/lib.rs:55:63 [INFO] [stderr] | [INFO] [stderr] 55 | #[derive(Debug, Clone, PartialEq, Eq, Serialize, Deserialize, ConfigDoc)] [INFO] [stderr] | ^^^^^^^^^ not found in `toml` [INFO] [stderr] | [INFO] [stderr] note: found an item that was configured out [INFO] [stderr] --> /opt/rustwide/cargo-home/registry/src/index.crates.io-1949cf8c6b5b557f/toml-1.1.8+spec-1.1.0/src/lib.rs:188:45 [INFO] [stderr] | [INFO] [stderr] 187 | #[cfg(feature = "serde")] [INFO] [stderr] | ----------------- the item is gated behind the `serde` feature [INFO] [stderr] 188 | pub use crate::ser::{Serializer, to_string, to_string_pretty}; [INFO] [stderr] | ^^^^^^^^^^^^^^^^ [INFO] [stderr] = note: this error originates in the derive macro `ConfigDoc` (in Nightly builds, run with -Z macro-backtrace for more info) [INFO] [stderr] [INFO] [stderr] error[E0425]: cannot find function `to_string_pretty` in crate `toml` [INFO] [stderr] --> /opt/rustwide/cargo-home/registry/src/index.crates.io-1949cf8c6b5b557f/bcode_agent_policy_models-0.0.1-alpha.0/src/lib.rs:98:63 [INFO] [stderr] | [INFO] [stderr] 98 | #[derive(Debug, Clone, PartialEq, Eq, Serialize, Deserialize, ConfigDoc)] [INFO] [stderr] | ^^^^^^^^^ not found in `toml` [INFO] [stderr] | [INFO] [stderr] note: found an item that was configured out [INFO] [stderr] --> /opt/rustwide/cargo-home/registry/src/index.crates.io-1949cf8c6b5b557f/toml-1.1.8+spec-1.1.0/src/lib.rs:188:45 [INFO] [stderr] | [INFO] [stderr] 187 | #[cfg(feature = "serde")] [INFO] [stderr] | ----------------- the item is gated behind the `serde` feature [INFO] [stderr] 188 | pub use crate::ser::{Serializer, to_string, to_string_pretty}; [INFO] [stderr] | ^^^^^^^^^^^^^^^^ [INFO] [stderr] = note: this error originates in the derive macro `ConfigDoc` (in Nightly builds, run with -Z macro-backtrace for more info) [INFO] [stderr] [INFO] [stderr] error[E0425]: cannot find function `to_string_pretty` in crate `toml` [INFO] [stderr] --> /opt/rustwide/cargo-home/registry/src/index.crates.io-1949cf8c6b5b557f/bcode_agent_policy_models-0.0.1-alpha.0/src/lib.rs:131:72 [INFO] [stderr] | [INFO] [stderr] 131 | #[derive(Debug, Clone, Default, PartialEq, Eq, Serialize, Deserialize, ConfigDoc)] [INFO] [stderr] | ^^^^^^^^^ not found in `toml` [INFO] [stderr] | [INFO] [stderr] note: found an item that was configured out [INFO] [stderr] --> /opt/rustwide/cargo-home/registry/src/index.crates.io-1949cf8c6b5b557f/toml-1.1.8+spec-1.1.0/src/lib.rs:188:45 [INFO] [stderr] | [INFO] [stderr] 187 | #[cfg(feature = "serde")] [INFO] [stderr] | ----------------- the item is gated behind the `serde` feature [INFO] [stderr] 188 | pub use crate::ser::{Serializer, to_string, to_string_pretty}; [INFO] [stderr] | ^^^^^^^^^^^^^^^^ [INFO] [stderr] = note: this error originates in the derive macro `ConfigDoc` (in Nightly builds, run with -Z macro-backtrace for more info) [INFO] [stderr] [INFO] [stderr] error[E0425]: cannot find function `to_string_pretty` in crate `toml` [INFO] [stderr] --> /opt/rustwide/cargo-home/registry/src/index.crates.io-1949cf8c6b5b557f/bcode_agent_policy_models-0.0.1-alpha.0/src/lib.rs:167:72 [INFO] [stderr] | [INFO] [stderr] 167 | #[derive(Debug, Clone, Default, PartialEq, Eq, Serialize, Deserialize, ConfigDoc)] [INFO] [stderr] | ^^^^^^^^^ not found in `toml` [INFO] [stderr] | [INFO] [stderr] note: found an item that was configured out [INFO] [stderr] --> /opt/rustwide/cargo-home/registry/src/index.crates.io-1949cf8c6b5b557f/toml-1.1.8+spec-1.1.0/src/lib.rs:188:45 [INFO] [stderr] | [INFO] [stderr] 187 | #[cfg(feature = "serde")] [INFO] [stderr] | ----------------- the item is gated behind the `serde` feature [INFO] [stderr] 188 | pub use crate::ser::{Serializer, to_string, to_string_pretty}; [INFO] [stderr] | ^^^^^^^^^^^^^^^^ [INFO] [stderr] = note: this error originates in the derive macro `ConfigDoc` (in Nightly builds, run with -Z macro-backtrace for more info) [INFO] [stderr] [INFO] [stderr] Some errors have detailed explanations: E0425, E0433. [INFO] [stderr] For more information about an error, try `rustc --explain E0425`. [INFO] [stderr] error: could not compile `bcode_agent_policy_models` (lib) due to 10 previous errors [INFO] [stderr] warning: build failed, waiting for other jobs to finish... [INFO] running `"docker" "inspect" "ffb3522969fbb90b6430c5a30375bb4be62bdee82c7596c6d4029a63b81166cb"`