bap 0.1.0

Rust bindings to BAP
Build #103397 2018-06-06T04:40:24.424931+00:00
# rustc version
rustc 1.28.0-dev (b9bf4f162 2018-06-02)
# version
cratesfyi 0.5.0 (579f83b 2018-03-05)

# build log
Build failed, waiting for other jobs to finish...
Updating registry ``
Fresh rustc-serialize v0.3.24
Fresh void v1.0.2
Fresh libc v0.2.42
Fresh unicode-xid v0.0.4
Fresh cfg-if v0.1.3
Fresh unicode-width v0.1.5
Fresh lazy_static v0.2.11
Fresh syntex_pos v0.58.1
Fresh peeking_take_while v0.1.2
Fresh which v1.0.5
Fresh atty v0.2.10
Fresh textwrap v0.9.0
Fresh rand v0.4.2
Fresh bitflags v0.9.1
Fresh bitflags v1.0.3
Fresh bitflags v0.8.2
Fresh bit-vec v0.4.4
Fresh rand v0.3.22
Fresh unreachable v1.0.0
Fresh strsim v0.7.0
Fresh log v0.4.2
Fresh num-traits v0.2.4
Fresh pkg-config v0.3.11
Fresh vec_map v0.8.1
Fresh ucd-util v0.1.1
Fresh memchr v2.0.1
Fresh lazy_static v1.0.1
Fresh memchr v1.0.2
Fresh log v0.3.9
Fresh num-traits v0.1.43
Fresh glob v0.2.11
Fresh regex-syntax v0.5.6
Fresh aho-corasick v0.6.4
Fresh thread_local v0.3.5
Fresh nom v3.2.1
Fresh enum_primitive v0.1.1
Fresh libloading v0.4.3
Fresh num-complex v0.1.43
Fresh utf8-ranges v1.0.0
Fresh uuid v0.1.18
Fresh cexpr v0.2.3
Fresh num-integer v0.1.38
Fresh ansi_term v0.11.0
Fresh term v0.4.6
Fresh regex v0.2.11
Compiling mktemp v0.3.1
Fresh num-bigint v0.1.44
Fresh num-iter v0.1.37
Fresh clap v2.31.2
Fresh clang-sys v0.19.0
Fresh syntex_errors v0.58.1
Fresh env_logger v0.4.3
Fresh num-rational v0.1.42
Fresh syntex_syntax v0.58.1
Fresh num v0.1.42
Fresh aster v0.41.0
Fresh syntex v0.58.1
Fresh quasi v0.32.0
Fresh quasi_codegen v0.32.0
Fresh bindgen v0.30.0
Compiling bap-sys v0.1.0
Running `/home/cratesfyi/cratesfyi/debug/build/bap-sys-b649302f13cc5366/build-script-build`
Running `rustc --crate-name mktemp .cargo/registry/src/ --crate-type lib --emit=dep-info,link -C debuginfo=2 -C metadata=67739b2e42b9eae1 -C extra-filename=-67739b2e42b9eae1 --out-dir /home/cratesfyi/cratesfyi/debug/deps -L dependency=/home/cratesfyi/cratesfyi/debug/deps --extern uuid=/home/cratesfyi/cratesfyi/debug/deps/libuuid-9d54d20637a1e138.rlib --extern-version uuid=uuid,0.1.18 --cap-lints allow`
error: failed to run custom build command for `bap-sys v0.1.0`
process didn't exit successfully: `/home/cratesfyi/cratesfyi/debug/build/bap-sys-b649302f13cc5366/build-script-build` (exit code: 101)
--- stdout
bap-sys.h:1:10: fatal error: 'bap.h' file not found, err: true

--- stderr
bap-sys.h:1:10: fatal error: 'bap.h' file not found
thread 'main' panicked at 'Unable to generate bindings: ()', libcore/
note: Run with `RUST_BACKTRACE=1` for a backtrace.

thread 'main' panicked at 'Error(
build failed
State {
next_error: None,
backtrace: None
)', src/bin/
note: Run with `RUST_BACKTRACE=1` for a backtrace.