array_segments 0.1.3

Store arrays in segment-lengths
Documentation

Build #2329528 2025-07-19 04:39:18

Build failed. If you want to re-trigger a documentation build, you can do it here. You can find more information on docs.rs builds documentation on the builds page.

# rustc version rustc 1.90.0-nightly (8f08b3a32 2025-07-18)

# docs.rs version docsrs 0.6.0 (c1135d19 2025-07-02)

# build log [INFO] running `Command { std: "docker" "create" "-v" "/home/cratesfyi/workspace/builds/array_segments-0.1.3/target:/opt/rustwide/target:rw,Z" "-v" "/home/cratesfyi/workspace/builds/array_segments-0.1.3/source:/opt/rustwide/workdir:ro,Z" "-v" "/home/cratesfyi/workspace/cargo-home:/opt/rustwide/cargo-home:ro,Z" "-v" "/home/cratesfyi/workspace/rustup-home:/opt/rustwide/rustup-home:ro,Z" "-e" "SOURCE_DIR=/opt/rustwide/workdir" "-e" "CARGO_TARGET_DIR=/opt/rustwide/target" "-e" "DOCS_RS=1" "-e" "CARGO_HOME=/opt/rustwide/cargo-home" "-e" "RUSTUP_HOME=/opt/rustwide/rustup-home" "-w" "/opt/rustwide/workdir" "-m" "6442450944" "--cpus" "6" "--user" "1001:1001" "--network" "none" "ghcr.io/rust-lang/crates-build-env/linux@sha256:cf8efcab8866f2cf4285301c7418e2f4f2a9b088c91ba69c40d5b659f81557f7" "/opt/rustwide/cargo-home/bin/cargo" "+nightly" "rustdoc" "--lib" "-Zrustdoc-map" "--config" "build.rustdocflags=[\"--cfg\", \"docsrs\", \"-Z\", \"unstable-options\", \"--emit=invocation-specific\", \"--resource-suffix\", \"-20250718-1.90.0-nightly-8f08b3a32\", \"--static-root-path\", \"/-/rustdoc.static/\", \"--cap-lints\", \"warn\", \"--extern-html-root-takes-precedence\"]" "--offline" "-Zunstable-options" "--config=doc.extern-map.registries.crates-io=\"https://docs.rs/{pkg_name}/{version}/x86_64-unknown-linux-gnu\"" "-Zrustdoc-scrape-examples" "-j6" "--target" "x86_64-unknown-linux-gnu", kill_on_drop: false }` [INFO] [stderr] WARNING: Your kernel does not support swap limit capabilities or the cgroup is not mounted. Memory limited without swap. [INFO] [stdout] d5be75b41933700c5cc07b20e2168da4325e089d2186d179b2d09f72a22cb68f [INFO] running `Command { std: "docker" "start" "-a" "d5be75b41933700c5cc07b20e2168da4325e089d2186d179b2d09f72a22cb68f", kill_on_drop: false }` [INFO] [stderr] warning: target filter specified, but no targets matched; this is a no-op [INFO] [stderr] Checking array__ops v0.1.20 [INFO] [stderr] error: let chains are only allowed in Rust 2024 or later [INFO] [stderr] --> /opt/rustwide/cargo-home/registry/src/index.crates.io-1949cf8c6b5b557f/array__ops-0.1.20/src/array_ops.rs:2723:12 [INFO] [stderr] | [INFO] [stderr] 2723 | if let Some(uv) = uv && let Some(uu) = uu [INFO] [stderr] | ^^^^^^^^^^^^^^^^^ [INFO] [stderr] [INFO] [stderr] error: let chains are only allowed in Rust 2024 or later [INFO] [stderr] --> /opt/rustwide/cargo-home/registry/src/index.crates.io-1949cf8c6b5b557f/array__ops-0.1.20/src/array_ops.rs:2723:33 [INFO] [stderr] | [INFO] [stderr] 2723 | if let Some(uv) = uv && let Some(uu) = uu [INFO] [stderr] | ^^^^^^^^^^^^^^^^^ [INFO] [stderr] [INFO] [stderr] error[E0635]: unknown feature `maybe_uninit_uninit_array` [INFO] [stderr] --> /opt/rustwide/cargo-home/registry/src/index.crates.io-1949cf8c6b5b557f/array__ops-0.1.20/src/lib.rs:9:12 [INFO] [stderr] | [INFO] [stderr] 9 | #![feature(maybe_uninit_uninit_array)] [INFO] [stderr] | ^^^^^^^^^^^^^^^^^^^^^^^^^ [INFO] [stderr] [INFO] [stderr] error[E0284]: type annotations needed: cannot satisfy `<Self as IntoIterator>::Item == [T; N]` [INFO] [stderr] --> /opt/rustwide/cargo-home/registry/src/index.crates.io-1949cf8c6b5b557f/array__ops-0.1.20/src/array_2d_ops.rs:6:58 [INFO] [stderr] | [INFO] [stderr] 6 | pub trait Array2dOps<T, const M: usize, const N: usize>: ArrayOps<[T; N], M> [INFO] [stderr] | ^^^^^^^^^^^^^^^^^^^ cannot satisfy `<Self as IntoIterator>::Item == [T; N]` [INFO] [stderr] | [INFO] [stderr] note: required by a bound in `array_ops::ArrayOps` [INFO] [stderr] --> /opt/rustwide/cargo-home/registry/src/index.crates.io-1949cf8c6b5b557f/array__ops-0.1.20/src/array_ops.rs:9:61 [INFO] [stderr] | [INFO] [stderr] 9 | pub trait ArrayOps<T, const N: usize>: Array + IntoIterator<Item = T> [INFO] [stderr] | ^^^^^^^^ required by this bound in `ArrayOps` [INFO] [stderr] [INFO] [stderr] error[E0220]: associated type `ItemNd` not found for `array_trait::ArrayNd` [INFO] [stderr] --> /opt/rustwide/cargo-home/registry/src/index.crates.io-1949cf8c6b5b557f/array__ops-0.1.20/src/array_nd_ops.rs:8:77 [INFO] [stderr] | [INFO] [stderr] 8 | pub trait ArrayNdOps<const D: usize, T, const L: usize>: Array + ArrayNd<D, ItemNd = T, /*FLAT_LENGTH = {L}*/> [INFO] [stderr] | ^^^^^^ help: there is an associated type with a similar name: `ElemNd` [INFO] [stderr] [INFO] [stderr] error[E0284]: type annotations needed: cannot satisfy `<Self as IntoIterator>::Item == T` [INFO] [stderr] | [INFO] [stderr] note: required by a bound in `array_ops::ArrayOps` [INFO] [stderr] --> /opt/rustwide/cargo-home/registry/src/index.crates.io-1949cf8c6b5b557f/array__ops-0.1.20/src/array_ops.rs:9:61 [INFO] [stderr] | [INFO] [stderr] 9 | pub trait ArrayOps<T, const N: usize>: Array + IntoIterator<Item = T> [INFO] [stderr] | ^^^^^^^^ required by this bound in `ArrayOps` [INFO] [stderr] [INFO] [stderr] error[E0284]: type annotations needed: cannot satisfy `<Self as IntoIterator>::Item == Simd<T, M>` [INFO] [stderr] --> /opt/rustwide/cargo-home/registry/src/index.crates.io-1949cf8c6b5b557f/array__ops-0.1.20/src/array_simd_ops.rs:5:60 [INFO] [stderr] | [INFO] [stderr] 5 | pub trait ArraySimdOps<T, const N: usize, const M: usize>: ArrayOps<Simd<T, M>, N> [INFO] [stderr] | ^^^^^^^^^^^^^^^^^^^^^^^ cannot satisfy `<Self as IntoIterator>::Item == Simd<T, M>` [INFO] [stderr] | [INFO] [stderr] note: required by a bound in `array_ops::ArrayOps` [INFO] [stderr] --> /opt/rustwide/cargo-home/registry/src/index.crates.io-1949cf8c6b5b557f/array__ops-0.1.20/src/array_ops.rs:9:61 [INFO] [stderr] | [INFO] [stderr] 9 | pub trait ArrayOps<T, const N: usize>: Array + IntoIterator<Item = T> [INFO] [stderr] | ^^^^^^^^ required by this bound in `ArrayOps` [INFO] [stderr] [INFO] [stderr] error[E0599]: no function or associated item named `uninit_array` found for union `MaybeUninit` in the current scope [INFO] [stderr] --> /opt/rustwide/cargo-home/registry/src/index.crates.io-1949cf8c6b5b557f/array__ops-0.1.20/src/array_nd_ops.rs:348:111 [INFO] [stderr] | [INFO] [stderr] 348 | unsafe {private::transmute_unchecked_size(MaybeUninit::<nd!{MaybeUninit<T>; $($($b)+)?}>::uninit_array::<$a>())}; [INFO] [stderr] | ^^^^^^^^^^^^ function or associated item not found in `MaybeUninit<[[[[[[[[[[[[[[[[...; _16]; _15]; _14]; _13]; _12]; _11]; _10]; _9]; _8]; _7]; _6]; _5]; _4]; _3]; _2]; _1]>` [INFO] [stderr] ... [INFO] [stderr] 454 | / impl_nd_array!( [INFO] [stderr] 455 | | _0 _1 _2 _3 _4 _5 _6 _7 _8 _9 _10 _11 _12 _13 _14 _15 _16 [INFO] [stderr] 456 | | ); [INFO] [stderr] | |_____- in this macro invocation [INFO] [stderr] | [INFO] [stderr] note: if you're trying to build a new `std::mem::MaybeUninit<[[[[[[[[[[[[[[[[std::mem::MaybeUninit<T>; _16]; _15]; _14]; _13]; _12]; _11]; _10]; _9]; _8]; _7]; _6]; _5]; _4]; _3]; _2]; _1]>` consider using one of the following associated functions: [INFO] [stderr] std::mem::MaybeUninit::<T>::new [INFO] [stderr] std::mem::MaybeUninit::<T>::uninit [INFO] [stderr] std::mem::MaybeUninit::<T>::zeroed [INFO] [stderr] --> /opt/rustwide/rustup-home/toolchains/nightly-x86_64-unknown-linux-gnu/lib/rustlib/src/rust/library/core/src/mem/maybe_uninit.rs:307:5 [INFO] [stderr] | [INFO] [stderr] 307 | pub const fn new(val: T) -> MaybeUninit<T> { [INFO] [stderr] | ^^^^^^^^^^^^^^^^^^^^^^^^^^^^^^^^^^^^^^^^^^ [INFO] [stderr] ... [INFO] [stderr] 330 | pub const fn uninit() -> MaybeUninit<T> { [INFO] [stderr] | ^^^^^^^^^^^^^^^^^^^^^^^^^^^^^^^^^^^^^^^ [INFO] [stderr] ... [INFO] [stderr] 380 | pub const fn zeroed() -> MaybeUninit<T> { [INFO] [stderr] | ^^^^^^^^^^^^^^^^^^^^^^^^^^^^^^^^^^^^^^^ [INFO] [stderr] = note: this error originates in the macro `impl_nd_array` (in Nightly builds, run with -Z macro-backtrace for more info) [INFO] [stderr] [INFO] [stderr] error[E0599]: no function or associated item named `uninit_array` found for union `MaybeUninit` in the current scope [INFO] [stderr] --> /opt/rustwide/cargo-home/registry/src/index.crates.io-1949cf8c6b5b557f/array__ops-0.1.20/src/array_nd_ops.rs:348:111 [INFO] [stderr] | [INFO] [stderr] 348 | unsafe {private::transmute_unchecked_size(MaybeUninit::<nd!{MaybeUninit<T>; $($($b)+)?}>::uninit_array::<$a>())}; [INFO] [stderr] | ^^^^^^^^^^^^ function or associated item not found in `MaybeUninit<[[[[[[[[[[[[[[[...; _16]; _15]; _14]; _13]; _12]; _11]; _10]; _9]; _8]; _7]; _6]; _5]; _4]; _3]; _2]>` [INFO] [stderr] ... [INFO] [stderr] 454 | / impl_nd_array!( [INFO] [stderr] 455 | | _0 _1 _2 _3 _4 _5 _6 _7 _8 _9 _10 _11 _12 _13 _14 _15 _16 [INFO] [stderr] 456 | | ); [INFO] [stderr] | |_____- in this macro invocation [INFO] [stderr] | [INFO] [stderr] note: if you're trying to build a new `std::mem::MaybeUninit<[[[[[[[[[[[[[[[std::mem::MaybeUninit<T>; _16]; _15]; _14]; _13]; _12]; _11]; _10]; _9]; _8]; _7]; _6]; _5]; _4]; _3]; _2]>` consider using one of the following associated functions: [INFO] [stderr] std::mem::MaybeUninit::<T>::new [INFO] [stderr] std::mem::MaybeUninit::<T>::uninit [INFO] [stderr] std::mem::MaybeUninit::<T>::zeroed [INFO] [stderr] --> /opt/rustwide/rustup-home/toolchains/nightly-x86_64-unknown-linux-gnu/lib/rustlib/src/rust/library/core/src/mem/maybe_uninit.rs:307:5 [INFO] [stderr] | [INFO] [stderr] 307 | pub const fn new(val: T) -> MaybeUninit<T> { [INFO] [stderr] | ^^^^^^^^^^^^^^^^^^^^^^^^^^^^^^^^^^^^^^^^^^ [INFO] [stderr] ... [INFO] [stderr] 330 | pub const fn uninit() -> MaybeUninit<T> { [INFO] [stderr] | ^^^^^^^^^^^^^^^^^^^^^^^^^^^^^^^^^^^^^^^ [INFO] [stderr] ... [INFO] [stderr] 380 | pub const fn zeroed() -> MaybeUninit<T> { [INFO] [stderr] | ^^^^^^^^^^^^^^^^^^^^^^^^^^^^^^^^^^^^^^^ [INFO] [stderr] = note: this error originates in the macro `impl_nd_array` (in Nightly builds, run with -Z macro-backtrace for more info) [INFO] [stderr] [INFO] [stderr] error[E0599]: no function or associated item named `uninit_array` found for union `MaybeUninit` in the current scope [INFO] [stderr] --> /opt/rustwide/cargo-home/registry/src/index.crates.io-1949cf8c6b5b557f/array__ops-0.1.20/src/array_nd_ops.rs:348:111 [INFO] [stderr] | [INFO] [stderr] 348 | unsafe {private::transmute_unchecked_size(MaybeUninit::<nd!{MaybeUninit<T>; $($($b)+)?}>::uninit_array::<$a>())}; [INFO] [stderr] | ^^^^^^^^^^^^ function or associated item not found in `MaybeUninit<[[[[[[[[[[[[[[...; _16]; _15]; _14]; _13]; _12]; _11]; _10]; _9]; _8]; _7]; _6]; _5]; _4]; _3]>` [INFO] [stderr] ... [INFO] [stderr] 454 | / impl_nd_array!( [INFO] [stderr] 455 | | _0 _1 _2 _3 _4 _5 _6 _7 _8 _9 _10 _11 _12 _13 _14 _15 _16 [INFO] [stderr] 456 | | ); [INFO] [stderr] | |_____- in this macro invocation [INFO] [stderr] | [INFO] [stderr] note: if you're trying to build a new `std::mem::MaybeUninit<[[[[[[[[[[[[[[std::mem::MaybeUninit<T>; _16]; _15]; _14]; _13]; _12]; _11]; _10]; _9]; _8]; _7]; _6]; _5]; _4]; _3]>` consider using one of the following associated functions: [INFO] [stderr] std::mem::MaybeUninit::<T>::new [INFO] [stderr] std::mem::MaybeUninit::<T>::uninit [INFO] [stderr] std::mem::MaybeUninit::<T>::zeroed [INFO] [stderr] --> /opt/rustwide/rustup-home/toolchains/nightly-x86_64-unknown-linux-gnu/lib/rustlib/src/rust/library/core/src/mem/maybe_uninit.rs:307:5 [INFO] [stderr] | [INFO] [stderr] 307 | pub const fn new(val: T) -> MaybeUninit<T> { [INFO] [stderr] | ^^^^^^^^^^^^^^^^^^^^^^^^^^^^^^^^^^^^^^^^^^ [INFO] [stderr] ... [INFO] [stderr] 330 | pub const fn uninit() -> MaybeUninit<T> { [INFO] [stderr] | ^^^^^^^^^^^^^^^^^^^^^^^^^^^^^^^^^^^^^^^ [INFO] [stderr] ... [INFO] [stderr] 380 | pub const fn zeroed() -> MaybeUninit<T> { [INFO] [stderr] | ^^^^^^^^^^^^^^^^^^^^^^^^^^^^^^^^^^^^^^^ [INFO] [stderr] = note: this error originates in the macro `impl_nd_array` (in Nightly builds, run with -Z macro-backtrace for more info) [INFO] [stderr] [INFO] [stderr] error[E0599]: no function or associated item named `uninit_array` found for union `MaybeUninit` in the current scope [INFO] [stderr] --> /opt/rustwide/cargo-home/registry/src/index.crates.io-1949cf8c6b5b557f/array__ops-0.1.20/src/array_nd_ops.rs:348:111 [INFO] [stderr] | [INFO] [stderr] 348 | unsafe {private::transmute_unchecked_size(MaybeUninit::<nd!{MaybeUninit<T>; $($($b)+)?}>::uninit_array::<$a>())}; [INFO] [stderr] | ^^^^^^^^^^^^ function or associated item not found in `MaybeUninit<[[[[[[[[[[[[[...; _16]; _15]; _14]; _13]; _12]; _11]; _10]; _9]; _8]; _7]; _6]; _5]; _4]>` [INFO] [stderr] ... [INFO] [stderr] 454 | / impl_nd_array!( [INFO] [stderr] 455 | | _0 _1 _2 _3 _4 _5 _6 _7 _8 _9 _10 _11 _12 _13 _14 _15 _16 [INFO] [stderr] 456 | | ); [INFO] [stderr] | |_____- in this macro invocation [INFO] [stderr] | [INFO] [stderr] note: if you're trying to build a new `std::mem::MaybeUninit<[[[[[[[[[[[[[std::mem::MaybeUninit<T>; _16]; _15]; _14]; _13]; _12]; _11]; _10]; _9]; _8]; _7]; _6]; _5]; _4]>` consider using one of the following associated functions: [INFO] [stderr] std::mem::MaybeUninit::<T>::new [INFO] [stderr] std::mem::MaybeUninit::<T>::uninit [INFO] [stderr] std::mem::MaybeUninit::<T>::zeroed [INFO] [stderr] --> /opt/rustwide/rustup-home/toolchains/nightly-x86_64-unknown-linux-gnu/lib/rustlib/src/rust/library/core/src/mem/maybe_uninit.rs:307:5 [INFO] [stderr] | [INFO] [stderr] 307 | pub const fn new(val: T) -> MaybeUninit<T> { [INFO] [stderr] | ^^^^^^^^^^^^^^^^^^^^^^^^^^^^^^^^^^^^^^^^^^ [INFO] [stderr] ... [INFO] [stderr] 330 | pub const fn uninit() -> MaybeUninit<T> { [INFO] [stderr] | ^^^^^^^^^^^^^^^^^^^^^^^^^^^^^^^^^^^^^^^ [INFO] [stderr] ... [INFO] [stderr] 380 | pub const fn zeroed() -> MaybeUninit<T> { [INFO] [stderr] | ^^^^^^^^^^^^^^^^^^^^^^^^^^^^^^^^^^^^^^^ [INFO] [stderr] = note: this error originates in the macro `impl_nd_array` (in Nightly builds, run with -Z macro-backtrace for more info) [INFO] [stderr] [INFO] [stderr] error[E0599]: no function or associated item named `uninit_array` found for union `MaybeUninit` in the current scope [INFO] [stderr] --> /opt/rustwide/cargo-home/registry/src/index.crates.io-1949cf8c6b5b557f/array__ops-0.1.20/src/array_nd_ops.rs:348:111 [INFO] [stderr] | [INFO] [stderr] 348 | unsafe {private::transmute_unchecked_size(MaybeUninit::<nd!{MaybeUninit<T>; $($($b)+)?}>::uninit_array::<$a>())}; [INFO] [stderr] | ^^^^^^^^^^^^ function or associated item not found in `MaybeUninit<[[[[[[[[[[[[...; _16]; _15]; _14]; _13]; _12]; _11]; _10]; _9]; _8]; _7]; _6]; _5]>` [INFO] [stderr] ... [INFO] [stderr] 454 | / impl_nd_array!( [INFO] [stderr] 455 | | _0 _1 _2 _3 _4 _5 _6 _7 _8 _9 _10 _11 _12 _13 _14 _15 _16 [INFO] [stderr] 456 | | ); [INFO] [stderr] | |_____- in this macro invocation [INFO] [stderr] | [INFO] [stderr] note: if you're trying to build a new `std::mem::MaybeUninit<[[[[[[[[[[[[std::mem::MaybeUninit<T>; _16]; _15]; _14]; _13]; _12]; _11]; _10]; _9]; _8]; _7]; _6]; _5]>` consider using one of the following associated functions: [INFO] [stderr] std::mem::MaybeUninit::<T>::new [INFO] [stderr] std::mem::MaybeUninit::<T>::uninit [INFO] [stderr] std::mem::MaybeUninit::<T>::zeroed [INFO] [stderr] --> /opt/rustwide/rustup-home/toolchains/nightly-x86_64-unknown-linux-gnu/lib/rustlib/src/rust/library/core/src/mem/maybe_uninit.rs:307:5 [INFO] [stderr] | [INFO] [stderr] 307 | pub const fn new(val: T) -> MaybeUninit<T> { [INFO] [stderr] | ^^^^^^^^^^^^^^^^^^^^^^^^^^^^^^^^^^^^^^^^^^ [INFO] [stderr] ... [INFO] [stderr] 330 | pub const fn uninit() -> MaybeUninit<T> { [INFO] [stderr] | ^^^^^^^^^^^^^^^^^^^^^^^^^^^^^^^^^^^^^^^ [INFO] [stderr] ... [INFO] [stderr] 380 | pub const fn zeroed() -> MaybeUninit<T> { [INFO] [stderr] | ^^^^^^^^^^^^^^^^^^^^^^^^^^^^^^^^^^^^^^^ [INFO] [stderr] = note: this error originates in the macro `impl_nd_array` (in Nightly builds, run with -Z macro-backtrace for more info) [INFO] [stderr] [INFO] [stderr] error[E0599]: no function or associated item named `uninit_array` found for union `MaybeUninit` in the current scope [INFO] [stderr] --> /opt/rustwide/cargo-home/registry/src/index.crates.io-1949cf8c6b5b557f/array__ops-0.1.20/src/array_nd_ops.rs:348:111 [INFO] [stderr] | [INFO] [stderr] 348 | unsafe {private::transmute_unchecked_size(MaybeUninit::<nd!{MaybeUninit<T>; $($($b)+)?}>::uninit_array::<$a>())}; [INFO] [stderr] | ^^^^^^^^^^^^ function or associated item not found in `MaybeUninit<[[[[[[[[[[[...; _16]; _15]; _14]; _13]; _12]; _11]; _10]; _9]; _8]; _7]; _6]>` [INFO] [stderr] ... [INFO] [stderr] 454 | / impl_nd_array!( [INFO] [stderr] 455 | | _0 _1 _2 _3 _4 _5 _6 _7 _8 _9 _10 _11 _12 _13 _14 _15 _16 [INFO] [stderr] 456 | | ); [INFO] [stderr] | |_____- in this macro invocation [INFO] [stderr] | [INFO] [stderr] note: if you're trying to build a new `std::mem::MaybeUninit<[[[[[[[[[[[std::mem::MaybeUninit<T>; _16]; _15]; _14]; _13]; _12]; _11]; _10]; _9]; _8]; _7]; _6]>` consider using one of the following associated functions: [INFO] [stderr] std::mem::MaybeUninit::<T>::new [INFO] [stderr] std::mem::MaybeUninit::<T>::uninit [INFO] [stderr] std::mem::MaybeUninit::<T>::zeroed [INFO] [stderr] --> /opt/rustwide/rustup-home/toolchains/nightly-x86_64-unknown-linux-gnu/lib/rustlib/src/rust/library/core/src/mem/maybe_uninit.rs:307:5 [INFO] [stderr] | [INFO] [stderr] 307 | pub const fn new(val: T) -> MaybeUninit<T> { [INFO] [stderr] | ^^^^^^^^^^^^^^^^^^^^^^^^^^^^^^^^^^^^^^^^^^ [INFO] [stderr] ... [INFO] [stderr] 330 | pub const fn uninit() -> MaybeUninit<T> { [INFO] [stderr] | ^^^^^^^^^^^^^^^^^^^^^^^^^^^^^^^^^^^^^^^ [INFO] [stderr] ... [INFO] [stderr] 380 | pub const fn zeroed() -> MaybeUninit<T> { [INFO] [stderr] | ^^^^^^^^^^^^^^^^^^^^^^^^^^^^^^^^^^^^^^^ [INFO] [stderr] = note: this error originates in the macro `impl_nd_array` (in Nightly builds, run with -Z macro-backtrace for more info) [INFO] [stderr] [INFO] [stderr] error[E0599]: no function or associated item named `uninit_array` found for union `MaybeUninit` in the current scope [INFO] [stderr] --> /opt/rustwide/cargo-home/registry/src/index.crates.io-1949cf8c6b5b557f/array__ops-0.1.20/src/array_nd_ops.rs:348:111 [INFO] [stderr] | [INFO] [stderr] 348 | unsafe {private::transmute_unchecked_size(MaybeUninit::<nd!{MaybeUninit<T>; $($($b)+)?}>::uninit_array::<$a>())}; [INFO] [stderr] | ^^^^^^^^^^^^ function or associated item not found in `MaybeUninit<[[[[[[[[[[...; _16]; _15]; _14]; _13]; _12]; _11]; _10]; _9]; _8]; _7]>` [INFO] [stderr] ... [INFO] [stderr] 454 | / impl_nd_array!( [INFO] [stderr] 455 | | _0 _1 _2 _3 _4 _5 _6 _7 _8 _9 _10 _11 _12 _13 _14 _15 _16 [INFO] [stderr] 456 | | ); [INFO] [stderr] | |_____- in this macro invocation [INFO] [stderr] | [INFO] [stderr] note: if you're trying to build a new `std::mem::MaybeUninit<[[[[[[[[[[std::mem::MaybeUninit<T>; _16]; _15]; _14]; _13]; _12]; _11]; _10]; _9]; _8]; _7]>` consider using one of the following associated functions: [INFO] [stderr] std::mem::MaybeUninit::<T>::new [INFO] [stderr] std::mem::MaybeUninit::<T>::uninit [INFO] [stderr] std::mem::MaybeUninit::<T>::zeroed [INFO] [stderr] --> /opt/rustwide/rustup-home/toolchains/nightly-x86_64-unknown-linux-gnu/lib/rustlib/src/rust/library/core/src/mem/maybe_uninit.rs:307:5 [INFO] [stderr] | [INFO] [stderr] 307 | pub const fn new(val: T) -> MaybeUninit<T> { [INFO] [stderr] | ^^^^^^^^^^^^^^^^^^^^^^^^^^^^^^^^^^^^^^^^^^ [INFO] [stderr] ... [INFO] [stderr] 330 | pub const fn uninit() -> MaybeUninit<T> { [INFO] [stderr] | ^^^^^^^^^^^^^^^^^^^^^^^^^^^^^^^^^^^^^^^ [INFO] [stderr] ... [INFO] [stderr] 380 | pub const fn zeroed() -> MaybeUninit<T> { [INFO] [stderr] | ^^^^^^^^^^^^^^^^^^^^^^^^^^^^^^^^^^^^^^^ [INFO] [stderr] = note: this error originates in the macro `impl_nd_array` (in Nightly builds, run with -Z macro-backtrace for more info) [INFO] [stderr] [INFO] [stderr] error[E0599]: no function or associated item named `uninit_array` found for union `MaybeUninit` in the current scope [INFO] [stderr] --> /opt/rustwide/cargo-home/registry/src/index.crates.io-1949cf8c6b5b557f/array__ops-0.1.20/src/array_nd_ops.rs:348:111 [INFO] [stderr] | [INFO] [stderr] 348 | unsafe {private::transmute_unchecked_size(MaybeUninit::<nd!{MaybeUninit<T>; $($($b)+)?}>::uninit_array::<$a>())}; [INFO] [stderr] | ^^^^^^^^^^^^ function or associated item not found in `MaybeUninit<[[[[[[[[[...; _16]; _15]; _14]; _13]; _12]; _11]; _10]; _9]; _8]>` [INFO] [stderr] ... [INFO] [stderr] 454 | / impl_nd_array!( [INFO] [stderr] 455 | | _0 _1 _2 _3 _4 _5 _6 _7 _8 _9 _10 _11 _12 _13 _14 _15 _16 [INFO] [stderr] 456 | | ); [INFO] [stderr] | |_____- in this macro invocation [INFO] [stderr] | [INFO] [stderr] note: if you're trying to build a new `std::mem::MaybeUninit<[[[[[[[[[std::mem::MaybeUninit<T>; _16]; _15]; _14]; _13]; _12]; _11]; _10]; _9]; _8]>` consider using one of the following associated functions: [INFO] [stderr] std::mem::MaybeUninit::<T>::new [INFO] [stderr] std::mem::MaybeUninit::<T>::uninit [INFO] [stderr] std::mem::MaybeUninit::<T>::zeroed [INFO] [stderr] --> /opt/rustwide/rustup-home/toolchains/nightly-x86_64-unknown-linux-gnu/lib/rustlib/src/rust/library/core/src/mem/maybe_uninit.rs:307:5 [INFO] [stderr] | [INFO] [stderr] 307 | pub const fn new(val: T) -> MaybeUninit<T> { [INFO] [stderr] | ^^^^^^^^^^^^^^^^^^^^^^^^^^^^^^^^^^^^^^^^^^ [INFO] [stderr] ... [INFO] [stderr] 330 | pub const fn uninit() -> MaybeUninit<T> { [INFO] [stderr] | ^^^^^^^^^^^^^^^^^^^^^^^^^^^^^^^^^^^^^^^ [INFO] [stderr] ... [INFO] [stderr] 380 | pub const fn zeroed() -> MaybeUninit<T> { [INFO] [stderr] | ^^^^^^^^^^^^^^^^^^^^^^^^^^^^^^^^^^^^^^^ [INFO] [stderr] = note: this error originates in the macro `impl_nd_array` (in Nightly builds, run with -Z macro-backtrace for more info) [INFO] [stderr] [INFO] [stderr] error[E0599]: no function or associated item named `uninit_array` found for union `MaybeUninit` in the current scope [INFO] [stderr] --> /opt/rustwide/cargo-home/registry/src/index.crates.io-1949cf8c6b5b557f/array__ops-0.1.20/src/array_nd_ops.rs:348:111 [INFO] [stderr] | [INFO] [stderr] 348 | unsafe {private::transmute_unchecked_size(MaybeUninit::<nd!{MaybeUninit<T>; $($($b)+)?}>::uninit_array::<$a>())}; [INFO] [stderr] | ^^^^^^^^^^^^ function or associated item not found in `MaybeUninit<[[[[[[[[...; _16]; _15]; _14]; _13]; _12]; _11]; _10]; _9]>` [INFO] [stderr] ... [INFO] [stderr] 454 | / impl_nd_array!( [INFO] [stderr] 455 | | _0 _1 _2 _3 _4 _5 _6 _7 _8 _9 _10 _11 _12 _13 _14 _15 _16 [INFO] [stderr] 456 | | ); [INFO] [stderr] | |_____- in this macro invocation [INFO] [stderr] | [INFO] [stderr] note: if you're trying to build a new `std::mem::MaybeUninit<[[[[[[[[std::mem::MaybeUninit<T>; _16]; _15]; _14]; _13]; _12]; _11]; _10]; _9]>` consider using one of the following associated functions: [INFO] [stderr] std::mem::MaybeUninit::<T>::new [INFO] [stderr] std::mem::MaybeUninit::<T>::uninit [INFO] [stderr] std::mem::MaybeUninit::<T>::zeroed [INFO] [stderr] --> /opt/rustwide/rustup-home/toolchains/nightly-x86_64-unknown-linux-gnu/lib/rustlib/src/rust/library/core/src/mem/maybe_uninit.rs:307:5 [INFO] [stderr] | [INFO] [stderr] 307 | pub const fn new(val: T) -> MaybeUninit<T> { [INFO] [stderr] | ^^^^^^^^^^^^^^^^^^^^^^^^^^^^^^^^^^^^^^^^^^ [INFO] [stderr] ... [INFO] [stderr] 330 | pub const fn uninit() -> MaybeUninit<T> { [INFO] [stderr] | ^^^^^^^^^^^^^^^^^^^^^^^^^^^^^^^^^^^^^^^ [INFO] [stderr] ... [INFO] [stderr] 380 | pub const fn zeroed() -> MaybeUninit<T> { [INFO] [stderr] | ^^^^^^^^^^^^^^^^^^^^^^^^^^^^^^^^^^^^^^^ [INFO] [stderr] = note: this error originates in the macro `impl_nd_array` (in Nightly builds, run with -Z macro-backtrace for more info) [INFO] [stderr] [INFO] [stderr] error[E0599]: no function or associated item named `uninit_array` found for union `MaybeUninit` in the current scope [INFO] [stderr] --> /opt/rustwide/cargo-home/registry/src/index.crates.io-1949cf8c6b5b557f/array__ops-0.1.20/src/array_nd_ops.rs:348:111 [INFO] [stderr] | [INFO] [stderr] 348 | unsafe {private::transmute_unchecked_size(MaybeUninit::<nd!{MaybeUninit<T>; $($($b)+)?}>::uninit_array::<$a>())}; [INFO] [stderr] | ^^^^^^^^^^^^ function or associated item not found in `MaybeUninit<[[[[[[[...; _16]; _15]; _14]; _13]; _12]; _11]; _10]>` [INFO] [stderr] ... [INFO] [stderr] 454 | / impl_nd_array!( [INFO] [stderr] 455 | | _0 _1 _2 _3 _4 _5 _6 _7 _8 _9 _10 _11 _12 _13 _14 _15 _16 [INFO] [stderr] 456 | | ); [INFO] [stderr] | |_____- in this macro invocation [INFO] [stderr] | [INFO] [stderr] note: if you're trying to build a new `std::mem::MaybeUninit<[[[[[[[std::mem::MaybeUninit<T>; _16]; _15]; _14]; _13]; _12]; _11]; _10]>` consider using one of the following associated functions: [INFO] [stderr] std::mem::MaybeUninit::<T>::new [INFO] [stderr] std::mem::MaybeUninit::<T>::uninit [INFO] [stderr] std::mem::MaybeUninit::<T>::zeroed [INFO] [stderr] --> /opt/rustwide/rustup-home/toolchains/nightly-x86_64-unknown-linux-gnu/lib/rustlib/src/rust/library/core/src/mem/maybe_uninit.rs:307:5 [INFO] [stderr] | [INFO] [stderr] 307 | pub const fn new(val: T) -> MaybeUninit<T> { [INFO] [stderr] | ^^^^^^^^^^^^^^^^^^^^^^^^^^^^^^^^^^^^^^^^^^ [INFO] [stderr] ... [INFO] [stderr] 330 | pub const fn uninit() -> MaybeUninit<T> { [INFO] [stderr] | ^^^^^^^^^^^^^^^^^^^^^^^^^^^^^^^^^^^^^^^ [INFO] [stderr] ... [INFO] [stderr] 380 | pub const fn zeroed() -> MaybeUninit<T> { [INFO] [stderr] | ^^^^^^^^^^^^^^^^^^^^^^^^^^^^^^^^^^^^^^^ [INFO] [stderr] = note: this error originates in the macro `impl_nd_array` (in Nightly builds, run with -Z macro-backtrace for more info) [INFO] [stderr] [INFO] [stderr] error[E0599]: no function or associated item named `uninit_array` found for union `std::mem::MaybeUninit` in the current scope [INFO] [stderr] --> /opt/rustwide/cargo-home/registry/src/index.crates.io-1949cf8c6b5b557f/array__ops-0.1.20/src/array_nd_ops.rs:348:111 [INFO] [stderr] | [INFO] [stderr] 348 | unsafe {private::transmute_unchecked_size(MaybeUninit::<nd!{MaybeUninit<T>; $($($b)+)?}>::uninit_array::<$a>())}; [INFO] [stderr] | ^^^^^^^^^^^^ function or associated item not found in `std::mem::MaybeUninit<[[[[[[std::mem::MaybeUninit<T>; _16]; _15]; _14]; _13]; _12]; _11]>` [INFO] [stderr] ... [INFO] [stderr] 454 | / impl_nd_array!( [INFO] [stderr] 455 | | _0 _1 _2 _3 _4 _5 _6 _7 _8 _9 _10 _11 _12 _13 _14 _15 _16 [INFO] [stderr] 456 | | ); [INFO] [stderr] | |_____- in this macro invocation [INFO] [stderr] | [INFO] [stderr] note: if you're trying to build a new `std::mem::MaybeUninit<[[[[[[std::mem::MaybeUninit<T>; _16]; _15]; _14]; _13]; _12]; _11]>` consider using one of the following associated functions: [INFO] [stderr] std::mem::MaybeUninit::<T>::new [INFO] [stderr] std::mem::MaybeUninit::<T>::uninit [INFO] [stderr] std::mem::MaybeUninit::<T>::zeroed [INFO] [stderr] --> /opt/rustwide/rustup-home/toolchains/nightly-x86_64-unknown-linux-gnu/lib/rustlib/src/rust/library/core/src/mem/maybe_uninit.rs:307:5 [INFO] [stderr] | [INFO] [stderr] 307 | pub const fn new(val: T) -> MaybeUninit<T> { [INFO] [stderr] | ^^^^^^^^^^^^^^^^^^^^^^^^^^^^^^^^^^^^^^^^^^ [INFO] [stderr] ... [INFO] [stderr] 330 | pub const fn uninit() -> MaybeUninit<T> { [INFO] [stderr] | ^^^^^^^^^^^^^^^^^^^^^^^^^^^^^^^^^^^^^^^ [INFO] [stderr] ... [INFO] [stderr] 380 | pub const fn zeroed() -> MaybeUninit<T> { [INFO] [stderr] | ^^^^^^^^^^^^^^^^^^^^^^^^^^^^^^^^^^^^^^^ [INFO] [stderr] = note: this error originates in the macro `impl_nd_array` (in Nightly builds, run with -Z macro-backtrace for more info) [INFO] [stderr] [INFO] [stderr] error[E0599]: no function or associated item named `uninit_array` found for union `std::mem::MaybeUninit` in the current scope [INFO] [stderr] --> /opt/rustwide/cargo-home/registry/src/index.crates.io-1949cf8c6b5b557f/array__ops-0.1.20/src/array_nd_ops.rs:348:111 [INFO] [stderr] | [INFO] [stderr] 348 | unsafe {private::transmute_unchecked_size(MaybeUninit::<nd!{MaybeUninit<T>; $($($b)+)?}>::uninit_array::<$a>())}; [INFO] [stderr] | ^^^^^^^^^^^^ function or associated item not found in `std::mem::MaybeUninit<[[[[[std::mem::MaybeUninit<T>; _16]; _15]; _14]; _13]; _12]>` [INFO] [stderr] ... [INFO] [stderr] 454 | / impl_nd_array!( [INFO] [stderr] 455 | | _0 _1 _2 _3 _4 _5 _6 _7 _8 _9 _10 _11 _12 _13 _14 _15 _16 [INFO] [stderr] 456 | | ); [INFO] [stderr] | |_____- in this macro invocation [INFO] [stderr] | [INFO] [stderr] note: if you're trying to build a new `std::mem::MaybeUninit<[[[[[std::mem::MaybeUninit<T>; _16]; _15]; _14]; _13]; _12]>` consider using one of the following associated functions: [INFO] [stderr] std::mem::MaybeUninit::<T>::new [INFO] [stderr] std::mem::MaybeUninit::<T>::uninit [INFO] [stderr] std::mem::MaybeUninit::<T>::zeroed [INFO] [stderr] --> /opt/rustwide/rustup-home/toolchains/nightly-x86_64-unknown-linux-gnu/lib/rustlib/src/rust/library/core/src/mem/maybe_uninit.rs:307:5 [INFO] [stderr] | [INFO] [stderr] 307 | pub const fn new(val: T) -> MaybeUninit<T> { [INFO] [stderr] | ^^^^^^^^^^^^^^^^^^^^^^^^^^^^^^^^^^^^^^^^^^ [INFO] [stderr] ... [INFO] [stderr] 330 | pub const fn uninit() -> MaybeUninit<T> { [INFO] [stderr] | ^^^^^^^^^^^^^^^^^^^^^^^^^^^^^^^^^^^^^^^ [INFO] [stderr] ... [INFO] [stderr] 380 | pub const fn zeroed() -> MaybeUninit<T> { [INFO] [stderr] | ^^^^^^^^^^^^^^^^^^^^^^^^^^^^^^^^^^^^^^^ [INFO] [stderr] = note: this error originates in the macro `impl_nd_array` (in Nightly builds, run with -Z macro-backtrace for more info) [INFO] [stderr] [INFO] [stderr] error[E0599]: no function or associated item named `uninit_array` found for union `std::mem::MaybeUninit` in the current scope [INFO] [stderr] --> /opt/rustwide/cargo-home/registry/src/index.crates.io-1949cf8c6b5b557f/array__ops-0.1.20/src/array_nd_ops.rs:348:111 [INFO] [stderr] | [INFO] [stderr] 348 | unsafe {private::transmute_unchecked_size(MaybeUninit::<nd!{MaybeUninit<T>; $($($b)+)?}>::uninit_array::<$a>())}; [INFO] [stderr] | ^^^^^^^^^^^^ function or associated item not found in `std::mem::MaybeUninit<[[[[std::mem::MaybeUninit<T>; _16]; _15]; _14]; _13]>` [INFO] [stderr] ... [INFO] [stderr] 454 | / impl_nd_array!( [INFO] [stderr] 455 | | _0 _1 _2 _3 _4 _5 _6 _7 _8 _9 _10 _11 _12 _13 _14 _15 _16 [INFO] [stderr] 456 | | ); [INFO] [stderr] | |_____- in this macro invocation [INFO] [stderr] | [INFO] [stderr] note: if you're trying to build a new `std::mem::MaybeUninit<[[[[std::mem::MaybeUninit<T>; _16]; _15]; _14]; _13]>` consider using one of the following associated functions: [INFO] [stderr] std::mem::MaybeUninit::<T>::new [INFO] [stderr] std::mem::MaybeUninit::<T>::uninit [INFO] [stderr] std::mem::MaybeUninit::<T>::zeroed [INFO] [stderr] --> /opt/rustwide/rustup-home/toolchains/nightly-x86_64-unknown-linux-gnu/lib/rustlib/src/rust/library/core/src/mem/maybe_uninit.rs:307:5 [INFO] [stderr] | [INFO] [stderr] 307 | pub const fn new(val: T) -> MaybeUninit<T> { [INFO] [stderr] | ^^^^^^^^^^^^^^^^^^^^^^^^^^^^^^^^^^^^^^^^^^ [INFO] [stderr] ... [INFO] [stderr] 330 | pub const fn uninit() -> MaybeUninit<T> { [INFO] [stderr] | ^^^^^^^^^^^^^^^^^^^^^^^^^^^^^^^^^^^^^^^ [INFO] [stderr] ... [INFO] [stderr] 380 | pub const fn zeroed() -> MaybeUninit<T> { [INFO] [stderr] | ^^^^^^^^^^^^^^^^^^^^^^^^^^^^^^^^^^^^^^^ [INFO] [stderr] = note: this error originates in the macro `impl_nd_array` (in Nightly builds, run with -Z macro-backtrace for more info) [INFO] [stderr] [INFO] [stderr] error[E0599]: no function or associated item named `uninit_array` found for union `std::mem::MaybeUninit` in the current scope [INFO] [stderr] --> /opt/rustwide/cargo-home/registry/src/index.crates.io-1949cf8c6b5b557f/array__ops-0.1.20/src/array_nd_ops.rs:348:111 [INFO] [stderr] | [INFO] [stderr] 348 | unsafe {private::transmute_unchecked_size(MaybeUninit::<nd!{MaybeUninit<T>; $($($b)+)?}>::uninit_array::<$a>())}; [INFO] [stderr] | ^^^^^^^^^^^^ function or associated item not found in `std::mem::MaybeUninit<[[[std::mem::MaybeUninit<T>; _16]; _15]; _14]>` [INFO] [stderr] ... [INFO] [stderr] 454 | / impl_nd_array!( [INFO] [stderr] 455 | | _0 _1 _2 _3 _4 _5 _6 _7 _8 _9 _10 _11 _12 _13 _14 _15 _16 [INFO] [stderr] 456 | | ); [INFO] [stderr] | |_____- in this macro invocation [INFO] [stderr] | [INFO] [stderr] note: if you're trying to build a new `std::mem::MaybeUninit<[[[std::mem::MaybeUninit<T>; _16]; _15]; _14]>` consider using one of the following associated functions: [INFO] [stderr] std::mem::MaybeUninit::<T>::new [INFO] [stderr] std::mem::MaybeUninit::<T>::uninit [INFO] [stderr] std::mem::MaybeUninit::<T>::zeroed [INFO] [stderr] --> /opt/rustwide/rustup-home/toolchains/nightly-x86_64-unknown-linux-gnu/lib/rustlib/src/rust/library/core/src/mem/maybe_uninit.rs:307:5 [INFO] [stderr] | [INFO] [stderr] 307 | pub const fn new(val: T) -> MaybeUninit<T> { [INFO] [stderr] | ^^^^^^^^^^^^^^^^^^^^^^^^^^^^^^^^^^^^^^^^^^ [INFO] [stderr] ... [INFO] [stderr] 330 | pub const fn uninit() -> MaybeUninit<T> { [INFO] [stderr] | ^^^^^^^^^^^^^^^^^^^^^^^^^^^^^^^^^^^^^^^ [INFO] [stderr] ... [INFO] [stderr] 380 | pub const fn zeroed() -> MaybeUninit<T> { [INFO] [stderr] | ^^^^^^^^^^^^^^^^^^^^^^^^^^^^^^^^^^^^^^^ [INFO] [stderr] = note: this error originates in the macro `impl_nd_array` (in Nightly builds, run with -Z macro-backtrace for more info) [INFO] [stderr] [INFO] [stderr] error[E0599]: no function or associated item named `uninit_array` found for union `std::mem::MaybeUninit` in the current scope [INFO] [stderr] --> /opt/rustwide/cargo-home/registry/src/index.crates.io-1949cf8c6b5b557f/array__ops-0.1.20/src/array_nd_ops.rs:348:111 [INFO] [stderr] | [INFO] [stderr] 348 | unsafe {private::transmute_unchecked_size(MaybeUninit::<nd!{MaybeUninit<T>; $($($b)+)?}>::uninit_array::<$a>())}; [INFO] [stderr] | ^^^^^^^^^^^^ function or associated item not found in `std::mem::MaybeUninit<[[std::mem::MaybeUninit<T>; _16]; _15]>` [INFO] [stderr] ... [INFO] [stderr] 454 | / impl_nd_array!( [INFO] [stderr] 455 | | _0 _1 _2 _3 _4 _5 _6 _7 _8 _9 _10 _11 _12 _13 _14 _15 _16 [INFO] [stderr] 456 | | ); [INFO] [stderr] | |_____- in this macro invocation [INFO] [stderr] | [INFO] [stderr] note: if you're trying to build a new `std::mem::MaybeUninit<[[std::mem::MaybeUninit<T>; _16]; _15]>` consider using one of the following associated functions: [INFO] [stderr] std::mem::MaybeUninit::<T>::new [INFO] [stderr] std::mem::MaybeUninit::<T>::uninit [INFO] [stderr] std::mem::MaybeUninit::<T>::zeroed [INFO] [stderr] --> /opt/rustwide/rustup-home/toolchains/nightly-x86_64-unknown-linux-gnu/lib/rustlib/src/rust/library/core/src/mem/maybe_uninit.rs:307:5 [INFO] [stderr] | [INFO] [stderr] 307 | pub const fn new(val: T) -> MaybeUninit<T> { [INFO] [stderr] | ^^^^^^^^^^^^^^^^^^^^^^^^^^^^^^^^^^^^^^^^^^ [INFO] [stderr] ... [INFO] [stderr] 330 | pub const fn uninit() -> MaybeUninit<T> { [INFO] [stderr] | ^^^^^^^^^^^^^^^^^^^^^^^^^^^^^^^^^^^^^^^ [INFO] [stderr] ... [INFO] [stderr] 380 | pub const fn zeroed() -> MaybeUninit<T> { [INFO] [stderr] | ^^^^^^^^^^^^^^^^^^^^^^^^^^^^^^^^^^^^^^^ [INFO] [stderr] = note: this error originates in the macro `impl_nd_array` (in Nightly builds, run with -Z macro-backtrace for more info) [INFO] [stderr] [INFO] [stderr] error[E0599]: no function or associated item named `uninit_array` found for union `std::mem::MaybeUninit` in the current scope [INFO] [stderr] --> /opt/rustwide/cargo-home/registry/src/index.crates.io-1949cf8c6b5b557f/array__ops-0.1.20/src/array_nd_ops.rs:348:111 [INFO] [stderr] | [INFO] [stderr] 348 | unsafe {private::transmute_unchecked_size(MaybeUninit::<nd!{MaybeUninit<T>; $($($b)+)?}>::uninit_array::<$a>())}; [INFO] [stderr] | ^^^^^^^^^^^^ function or associated item not found in `std::mem::MaybeUninit<[std::mem::MaybeUninit<T>; _16]>` [INFO] [stderr] ... [INFO] [stderr] 454 | / impl_nd_array!( [INFO] [stderr] 455 | | _0 _1 _2 _3 _4 _5 _6 _7 _8 _9 _10 _11 _12 _13 _14 _15 _16 [INFO] [stderr] 456 | | ); [INFO] [stderr] | |_____- in this macro invocation [INFO] [stderr] | [INFO] [stderr] note: if you're trying to build a new `std::mem::MaybeUninit<[std::mem::MaybeUninit<T>; _16]>` consider using one of the following associated functions: [INFO] [stderr] std::mem::MaybeUninit::<T>::new [INFO] [stderr] std::mem::MaybeUninit::<T>::uninit [INFO] [stderr] std::mem::MaybeUninit::<T>::zeroed [INFO] [stderr] --> /opt/rustwide/rustup-home/toolchains/nightly-x86_64-unknown-linux-gnu/lib/rustlib/src/rust/library/core/src/mem/maybe_uninit.rs:307:5 [INFO] [stderr] | [INFO] [stderr] 307 | pub const fn new(val: T) -> MaybeUninit<T> { [INFO] [stderr] | ^^^^^^^^^^^^^^^^^^^^^^^^^^^^^^^^^^^^^^^^^^ [INFO] [stderr] ... [INFO] [stderr] 330 | pub const fn uninit() -> MaybeUninit<T> { [INFO] [stderr] | ^^^^^^^^^^^^^^^^^^^^^^^^^^^^^^^^^^^^^^^ [INFO] [stderr] ... [INFO] [stderr] 380 | pub const fn zeroed() -> MaybeUninit<T> { [INFO] [stderr] | ^^^^^^^^^^^^^^^^^^^^^^^^^^^^^^^^^^^^^^^ [INFO] [stderr] = note: this error originates in the macro `impl_nd_array` (in Nightly builds, run with -Z macro-backtrace for more info) [INFO] [stderr] [INFO] [stderr] error[E0599]: no function or associated item named `uninit_array` found for union `std::mem::MaybeUninit` in the current scope [INFO] [stderr] --> /opt/rustwide/cargo-home/registry/src/index.crates.io-1949cf8c6b5b557f/array__ops-0.1.20/src/array_nd_ops.rs:348:111 [INFO] [stderr] | [INFO] [stderr] 348 | unsafe {private::transmute_unchecked_size(MaybeUninit::<nd!{MaybeUninit<T>; $($($b)+)?}>::uninit_array::<$a>())}; [INFO] [stderr] | ^^^^^^^^^^^^ function or associated item not found in `std::mem::MaybeUninit<std::mem::MaybeUninit<T>>` [INFO] [stderr] ... [INFO] [stderr] 454 | / impl_nd_array!( [INFO] [stderr] 455 | | _0 _1 _2 _3 _4 _5 _6 _7 _8 _9 _10 _11 _12 _13 _14 _15 _16 [INFO] [stderr] 456 | | ); [INFO] [stderr] | |_____- in this macro invocation [INFO] [stderr] | [INFO] [stderr] note: if you're trying to build a new `std::mem::MaybeUninit<std::mem::MaybeUninit<T>>` consider using one of the following associated functions: [INFO] [stderr] std::mem::MaybeUninit::<T>::new [INFO] [stderr] std::mem::MaybeUninit::<T>::uninit [INFO] [stderr] std::mem::MaybeUninit::<T>::zeroed [INFO] [stderr] --> /opt/rustwide/rustup-home/toolchains/nightly-x86_64-unknown-linux-gnu/lib/rustlib/src/rust/library/core/src/mem/maybe_uninit.rs:307:5 [INFO] [stderr] | [INFO] [stderr] 307 | pub const fn new(val: T) -> MaybeUninit<T> { [INFO] [stderr] | ^^^^^^^^^^^^^^^^^^^^^^^^^^^^^^^^^^^^^^^^^^ [INFO] [stderr] ... [INFO] [stderr] 330 | pub const fn uninit() -> MaybeUninit<T> { [INFO] [stderr] | ^^^^^^^^^^^^^^^^^^^^^^^^^^^^^^^^^^^^^^^ [INFO] [stderr] ... [INFO] [stderr] 380 | pub const fn zeroed() -> MaybeUninit<T> { [INFO] [stderr] | ^^^^^^^^^^^^^^^^^^^^^^^^^^^^^^^^^^^^^^^ [INFO] [stderr] = note: this error originates in the macro `impl_nd_array` (in Nightly builds, run with -Z macro-backtrace for more info) [INFO] [stderr] [INFO] [stderr] error[E0599]: no function or associated item named `uninit_array` found for union `std::mem::MaybeUninit` in the current scope [INFO] [stderr] --> /opt/rustwide/cargo-home/registry/src/index.crates.io-1949cf8c6b5b557f/array__ops-0.1.20/src/array_ops.rs:1601:38 [INFO] [stderr] | [INFO] [stderr] 1601 | let mut array = MaybeUninit::uninit_array(); [INFO] [stderr] | ^^^^^^^^^^^^ function or associated item not found in `std::mem::MaybeUninit<_>` [INFO] [stderr] | [INFO] [stderr] note: if you're trying to build a new `std::mem::MaybeUninit<_>` consider using one of the following associated functions: [INFO] [stderr] std::mem::MaybeUninit::<T>::new [INFO] [stderr] std::mem::MaybeUninit::<T>::uninit [INFO] [stderr] std::mem::MaybeUninit::<T>::zeroed [INFO] [stderr] --> /opt/rustwide/rustup-home/toolchains/nightly-x86_64-unknown-linux-gnu/lib/rustlib/src/rust/library/core/src/mem/maybe_uninit.rs:307:5 [INFO] [stderr] | [INFO] [stderr] 307 | pub const fn new(val: T) -> MaybeUninit<T> { [INFO] [stderr] | ^^^^^^^^^^^^^^^^^^^^^^^^^^^^^^^^^^^^^^^^^^ [INFO] [stderr] ... [INFO] [stderr] 330 | pub const fn uninit() -> MaybeUninit<T> { [INFO] [stderr] | ^^^^^^^^^^^^^^^^^^^^^^^^^^^^^^^^^^^^^^^ [INFO] [stderr] ... [INFO] [stderr] 380 | pub const fn zeroed() -> MaybeUninit<T> { [INFO] [stderr] | ^^^^^^^^^^^^^^^^^^^^^^^^^^^^^^^^^^^^^^^ [INFO] [stderr] help: there is an associated function `uninit` with a similar name [INFO] [stderr] | [INFO] [stderr] 1601 - let mut array = MaybeUninit::uninit_array(); [INFO] [stderr] 1601 + let mut array = MaybeUninit::uninit(); [INFO] [stderr] | [INFO] [stderr] [INFO] [stderr] error[E0599]: no function or associated item named `uninit_array` found for union `std::mem::MaybeUninit` in the current scope [INFO] [stderr] --> /opt/rustwide/cargo-home/registry/src/index.crates.io-1949cf8c6b5b557f/array__ops-0.1.20/src/array_ops.rs:1614:38 [INFO] [stderr] | [INFO] [stderr] 1614 | let mut array = MaybeUninit::uninit_array(); [INFO] [stderr] | ^^^^^^^^^^^^ function or associated item not found in `std::mem::MaybeUninit<_>` [INFO] [stderr] | [INFO] [stderr] note: if you're trying to build a new `std::mem::MaybeUninit<_>` consider using one of the following associated functions: [INFO] [stderr] std::mem::MaybeUninit::<T>::new [INFO] [stderr] std::mem::MaybeUninit::<T>::uninit [INFO] [stderr] std::mem::MaybeUninit::<T>::zeroed [INFO] [stderr] --> /opt/rustwide/rustup-home/toolchains/nightly-x86_64-unknown-linux-gnu/lib/rustlib/src/rust/library/core/src/mem/maybe_uninit.rs:307:5 [INFO] [stderr] | [INFO] [stderr] 307 | pub const fn new(val: T) -> MaybeUninit<T> { [INFO] [stderr] | ^^^^^^^^^^^^^^^^^^^^^^^^^^^^^^^^^^^^^^^^^^ [INFO] [stderr] ... [INFO] [stderr] 330 | pub const fn uninit() -> MaybeUninit<T> { [INFO] [stderr] | ^^^^^^^^^^^^^^^^^^^^^^^^^^^^^^^^^^^^^^^ [INFO] [stderr] ... [INFO] [stderr] 380 | pub const fn zeroed() -> MaybeUninit<T> { [INFO] [stderr] | ^^^^^^^^^^^^^^^^^^^^^^^^^^^^^^^^^^^^^^^ [INFO] [stderr] help: there is an associated function `uninit` with a similar name [INFO] [stderr] | [INFO] [stderr] 1614 - let mut array = MaybeUninit::uninit_array(); [INFO] [stderr] 1614 + let mut array = MaybeUninit::uninit(); [INFO] [stderr] | [INFO] [stderr] [INFO] [stderr] Some errors have detailed explanations: E0220, E0284, E0599, E0635. [INFO] [stderr] For more information about an error, try `rustc --explain E0220`. [INFO] [stderr] error: could not compile `array__ops` (lib) due to 26 previous errors [INFO] running `Command { std: "docker" "inspect" "d5be75b41933700c5cc07b20e2168da4325e089d2186d179b2d09f72a22cb68f", kill_on_drop: false }` [INFO] running `Command { std: "docker" "rm" "-f" "d5be75b41933700c5cc07b20e2168da4325e089d2186d179b2d09f72a22cb68f", kill_on_drop: false }` [INFO] [stdout] d5be75b41933700c5cc07b20e2168da4325e089d2186d179b2d09f72a22cb68f