Build failed. If you want to re-trigger a documentation build, you can do it here. You can find more information on docs.rs builds documentation on the builds page.
# rustc version
rustc 1.90.0-nightly (706f244db 2025-06-23)# docs.rs version
docsrs 0.6.0 (0a8149e8 2025-06-15)# build log
[INFO] running `Command { std: "docker" "create" "-v" "/home/cratesfyi/workspace/builds/apollo-hyper-api-interface-0.1.1/target:/opt/rustwide/target:rw,Z" "-v" "/home/cratesfyi/workspace/builds/apollo-hyper-api-interface-0.1.1/source:/opt/rustwide/workdir:ro,Z" "-v" "/home/cratesfyi/workspace/cargo-home:/opt/rustwide/cargo-home:ro,Z" "-v" "/home/cratesfyi/workspace/rustup-home:/opt/rustwide/rustup-home:ro,Z" "-e" "SOURCE_DIR=/opt/rustwide/workdir" "-e" "CARGO_TARGET_DIR=/opt/rustwide/target" "-e" "DOCS_RS=1" "-e" "CARGO_HOME=/opt/rustwide/cargo-home" "-e" "RUSTUP_HOME=/opt/rustwide/rustup-home" "-w" "/opt/rustwide/workdir" "-m" "6442450944" "--cpus" "6" "--user" "1001:1001" "--network" "none" "ghcr.io/rust-lang/crates-build-env/linux@sha256:90999bfc7ae267e83380e433d8e61a7c072ca6729e92edbae886d3423b3a6f4c" "/opt/rustwide/cargo-home/bin/cargo" "+nightly" "rustdoc" "--lib" "-Zrustdoc-map" "--config" "build.rustdocflags=[\"--cfg\", \"docsrs\", \"-Z\", \"unstable-options\", \"--emit=invocation-specific\", \"--resource-suffix\", \"-20250623-1.90.0-nightly-706f244db\", \"--static-root-path\", \"/-/rustdoc.static/\", \"--cap-lints\", \"warn\", \"--extern-html-root-takes-precedence\"]" "--offline" "-Zunstable-options" "--config=doc.extern-map.registries.crates-io=\"https://docs.rs/{pkg_name}/{version}/x86_64-unknown-linux-gnu\"" "-Zrustdoc-scrape-examples" "-j6" "--target" "x86_64-unknown-linux-gnu", kill_on_drop: false }`
[INFO] [stderr] WARNING: Your kernel does not support swap limit capabilities or the cgroup is not mounted. Memory limited without swap.
[INFO] [stdout] 435f3caa20a81a773f11aedf051fd98ec317335c15b32287764e1f45f1a9ce9c
[INFO] running `Command { std: "docker" "start" "-a" "435f3caa20a81a773f11aedf051fd98ec317335c15b32287764e1f45f1a9ce9c", kill_on_drop: false }`
[INFO] [stderr] warning: target filter specified, but no targets matched; this is a no-op
[INFO] [stderr] Checking printf-compat v0.1.1
[INFO] [stderr] error[E0277]: the trait bound `i8: VaArgSafe` is not satisfied
[INFO] [stderr] --> /opt/rustwide/cargo-home/registry/src/index.crates.io-1949cf8c6b5b557f/printf-compat-0.1.1/src/parser.rs:80:50
[INFO] [stderr] |
[INFO] [stderr] 80 | Length::Char => SignedInt::Char(args.arg()),
[INFO] [stderr] | ^^^ the trait `VaArgSafe` is not implemented for `i8`
[INFO] [stderr] |
[INFO] [stderr] = help: the following other types implement trait `VaArgSafe`:
[INFO] [stderr] f64
[INFO] [stderr] i32
[INFO] [stderr] i64
[INFO] [stderr] isize
[INFO] [stderr] u32
[INFO] [stderr] u64
[INFO] [stderr] usize
[INFO] [stderr] note: required by a bound in `VaListImpl::<'f>::arg`
[INFO] [stderr] --> /opt/rustwide/rustup-home/toolchains/nightly-x86_64-unknown-linux-gnu/lib/rustlib/src/rust/library/core/src/ffi/va_list.rs:237:26
[INFO] [stderr] |
[INFO] [stderr] 237 | pub unsafe fn arg<T: VaArgSafe>(&mut self) -> T {
[INFO] [stderr] | ^^^^^^^^^ required by this bound in `VaListImpl::<'f>::arg`
[INFO] [stderr]
[INFO] [stderr] error[E0277]: the trait bound `i16: VaArgSafe` is not satisfied
[INFO] [stderr] --> /opt/rustwide/cargo-home/registry/src/index.crates.io-1949cf8c6b5b557f/printf-compat-0.1.1/src/parser.rs:81:52
[INFO] [stderr] |
[INFO] [stderr] 81 | Length::Short => SignedInt::Short(args.arg()),
[INFO] [stderr] | ^^^ the trait `VaArgSafe` is not implemented for `i16`
[INFO] [stderr] |
[INFO] [stderr] = help: the following other types implement trait `VaArgSafe`:
[INFO] [stderr] f64
[INFO] [stderr] i32
[INFO] [stderr] i64
[INFO] [stderr] isize
[INFO] [stderr] u32
[INFO] [stderr] u64
[INFO] [stderr] usize
[INFO] [stderr] note: required by a bound in `VaListImpl::<'f>::arg`
[INFO] [stderr] --> /opt/rustwide/rustup-home/toolchains/nightly-x86_64-unknown-linux-gnu/lib/rustlib/src/rust/library/core/src/ffi/va_list.rs:237:26
[INFO] [stderr] |
[INFO] [stderr] 237 | pub unsafe fn arg<T: VaArgSafe>(&mut self) -> T {
[INFO] [stderr] | ^^^^^^^^^ required by this bound in `VaListImpl::<'f>::arg`
[INFO] [stderr]
[INFO] [stderr] error[E0277]: the trait bound `u8: VaArgSafe` is not satisfied
[INFO] [stderr] --> /opt/rustwide/cargo-home/registry/src/index.crates.io-1949cf8c6b5b557f/printf-compat-0.1.1/src/parser.rs:91:52
[INFO] [stderr] |
[INFO] [stderr] 91 | Length::Char => UnsignedInt::Char(args.arg()),
[INFO] [stderr] | ^^^ the trait `VaArgSafe` is not implemented for `u8`
[INFO] [stderr] |
[INFO] [stderr] = help: the following other types implement trait `VaArgSafe`:
[INFO] [stderr] f64
[INFO] [stderr] i32
[INFO] [stderr] i64
[INFO] [stderr] isize
[INFO] [stderr] u32
[INFO] [stderr] u64
[INFO] [stderr] usize
[INFO] [stderr] note: required by a bound in `VaListImpl::<'f>::arg`
[INFO] [stderr] --> /opt/rustwide/rustup-home/toolchains/nightly-x86_64-unknown-linux-gnu/lib/rustlib/src/rust/library/core/src/ffi/va_list.rs:237:26
[INFO] [stderr] |
[INFO] [stderr] 237 | pub unsafe fn arg<T: VaArgSafe>(&mut self) -> T {
[INFO] [stderr] | ^^^^^^^^^ required by this bound in `VaListImpl::<'f>::arg`
[INFO] [stderr]
[INFO] [stderr] error[E0277]: the trait bound `u16: VaArgSafe` is not satisfied
[INFO] [stderr] --> /opt/rustwide/cargo-home/registry/src/index.crates.io-1949cf8c6b5b557f/printf-compat-0.1.1/src/parser.rs:92:54
[INFO] [stderr] |
[INFO] [stderr] 92 | Length::Short => UnsignedInt::Short(args.arg()),
[INFO] [stderr] | ^^^ the trait `VaArgSafe` is not implemented for `u16`
[INFO] [stderr] |
[INFO] [stderr] = help: the following other types implement trait `VaArgSafe`:
[INFO] [stderr] f64
[INFO] [stderr] i32
[INFO] [stderr] i64
[INFO] [stderr] isize
[INFO] [stderr] u32
[INFO] [stderr] u64
[INFO] [stderr] usize
[INFO] [stderr] note: required by a bound in `VaListImpl::<'f>::arg`
[INFO] [stderr] --> /opt/rustwide/rustup-home/toolchains/nightly-x86_64-unknown-linux-gnu/lib/rustlib/src/rust/library/core/src/ffi/va_list.rs:237:26
[INFO] [stderr] |
[INFO] [stderr] 237 | pub unsafe fn arg<T: VaArgSafe>(&mut self) -> T {
[INFO] [stderr] | ^^^^^^^^^ required by this bound in `VaListImpl::<'f>::arg`
[INFO] [stderr]
[INFO] [stderr] error[E0277]: the trait bound `u8: VaArgSafe` is not satisfied
[INFO] [stderr] --> /opt/rustwide/cargo-home/registry/src/index.crates.io-1949cf8c6b5b557f/printf-compat-0.1.1/src/parser.rs:194:46
[INFO] [stderr] |
[INFO] [stderr] 194 | b'c' => Specifier::Char(args.arg()),
[INFO] [stderr] | ^^^ the trait `VaArgSafe` is not implemented for `u8`
[INFO] [stderr] |
[INFO] [stderr] = help: the following other types implement trait `VaArgSafe`:
[INFO] [stderr] f64
[INFO] [stderr] i32
[INFO] [stderr] i64
[INFO] [stderr] isize
[INFO] [stderr] u32
[INFO] [stderr] u64
[INFO] [stderr] usize
[INFO] [stderr] note: required by a bound in `VaListImpl::<'f>::arg`
[INFO] [stderr] --> /opt/rustwide/rustup-home/toolchains/nightly-x86_64-unknown-linux-gnu/lib/rustlib/src/rust/library/core/src/ffi/va_list.rs:237:26
[INFO] [stderr] |
[INFO] [stderr] 237 | pub unsafe fn arg<T: VaArgSafe>(&mut self) -> T {
[INFO] [stderr] | ^^^^^^^^^ required by this bound in `VaListImpl::<'f>::arg`
[INFO] [stderr]
[INFO] [stderr] For more information about this error, try `rustc --explain E0277`.
[INFO] [stderr] error: could not compile `printf-compat` (lib) due to 5 previous errors
[INFO] running `Command { std: "docker" "inspect" "435f3caa20a81a773f11aedf051fd98ec317335c15b32287764e1f45f1a9ce9c", kill_on_drop: false }`
[INFO] running `Command { std: "docker" "rm" "-f" "435f3caa20a81a773f11aedf051fd98ec317335c15b32287764e1f45f1a9ce9c", kill_on_drop: false }`
[INFO] [stdout] 435f3caa20a81a773f11aedf051fd98ec317335c15b32287764e1f45f1a9ce9c