wasmcloud-interface-sqldb 0.11.0

Interface for wasmCloud actors to connect to a relational database using the capability wasmcloud:sqldb
Documentation
Build #1865038 2025-03-14 05:25:18

Build failed. If you want to re-trigger a documentation build, you can do it here. You can find more information on docs.rs builds documentation on the builds page.

# rustc version
rustc 1.87.0-nightly (cbfdf0b01 2025-03-13)# docs.rs version
docsrs 0.6.0 (004a02c4 2025-03-05)# build log
[INFO] running `Command { std: "docker" "create" "-v" "/home/cratesfyi/workspace-builder/builds/wasmcloud-interface-sqldb-0.11.0/target:/opt/rustwide/target:rw,Z" "-v" "/home/cratesfyi/workspace-builder/builds/wasmcloud-interface-sqldb-0.11.0/source:/opt/rustwide/workdir:ro,Z" "-v" "/home/cratesfyi/workspace-builder/cargo-home:/opt/rustwide/cargo-home:ro,Z" "-v" "/home/cratesfyi/workspace-builder/rustup-home:/opt/rustwide/rustup-home:ro,Z" "-e" "SOURCE_DIR=/opt/rustwide/workdir" "-e" "CARGO_TARGET_DIR=/opt/rustwide/target" "-e" "DOCS_RS=1" "-e" "CARGO_HOME=/opt/rustwide/cargo-home" "-e" "RUSTUP_HOME=/opt/rustwide/rustup-home" "-w" "/opt/rustwide/workdir" "-m" "6442450944" "--cpus" "6" "--user" "1001:1001" "--network" "none" "ghcr.io/rust-lang/crates-build-env/linux@sha256:1680c8fbd8dfb46fcd6d22e546df16ab0e007457dc29fcd9e987cdd5077fd1af" "/opt/rustwide/cargo-home/bin/cargo" "+nightly" "rustdoc" "--lib" "-Zrustdoc-map" "--config" "build.rustdocflags=[\"--cfg\", \"docsrs\", \"-Z\", \"unstable-options\", \"--emit=invocation-specific\", \"--resource-suffix\", \"-20250313-1.87.0-nightly-cbfdf0b01\", \"--static-root-path\", \"/-/rustdoc.static/\", \"--cap-lints\", \"warn\", \"--extern-html-root-takes-precedence\"]" "--offline" "-Zunstable-options" "--config=doc.extern-map.registries.crates-io=\"https://docs.rs/{pkg_name}/{version}/x86_64-unknown-linux-gnu\"" "-Zrustdoc-scrape-examples" "-j6" "--target" "x86_64-unknown-linux-gnu", kill_on_drop: false }`
[INFO] [stdout] 8a875d284ccfbb7e55ad6ef5c6dfcbb19c92a03b72ae5a5ee7216e13774ea6f1
[INFO] [stderr] WARNING: Your kernel does not support swap limit capabilities or the cgroup is not mounted. Memory limited without swap.
[INFO] running `Command { std: "docker" "start" "-a" "8a875d284ccfbb7e55ad6ef5c6dfcbb19c92a03b72ae5a5ee7216e13774ea6f1", kill_on_drop: false }`
[INFO] [stderr] warning: target filter specified, but no targets matched; this is a no-op
[INFO] [stderr]     Checking url v2.5.4
[INFO] [stderr]     Checking tokio-rustls v0.24.1
[INFO] [stderr]     Checking tokio-retry v0.3.0
[INFO] [stderr]     Checking nuid v0.4.1
[INFO] [stderr]     Checking nuid v0.3.2
[INFO] [stderr]     Checking sharded-slab v0.1.7
[INFO] [stderr] error[E0432]: unresolved import `rand::distributions`
[INFO] [stderr]   --> /opt/rustwide/cargo-home/registry/src/index.crates.io-1949cf8c6b5b557f/nuid-0.4.1/src/lib.rs:19:11
[INFO] [stderr]    |
[INFO] [stderr] 19 | use rand::distributions::Alphanumeric;
[INFO] [stderr]    |           ^^^^^^^^^^^^^ could not find `distributions` in `rand`
[INFO] [stderr] 
[INFO] [stderr] error[E0432]: unresolved import `rand::distributions`
[INFO] [stderr]   --> /opt/rustwide/cargo-home/registry/src/index.crates.io-1949cf8c6b5b557f/nuid-0.3.2/src/lib.rs:19:11
[INFO] [stderr]    |
[INFO] [stderr] 19 | use rand::distributions::Alphanumeric;
[INFO] [stderr]    |           ^^^^^^^^^^^^^ could not find `distributions` in `rand`
[INFO] [stderr] 
[INFO] [stderr] error[E0599]: the method `sample_iter` exists for struct `OsRng`, but its trait bounds were not satisfied
[INFO] [stderr]   --> /opt/rustwide/cargo-home/registry/src/index.crates.io-1949cf8c6b5b557f/nuid-0.4.1/src/lib.rs:84:27
[INFO] [stderr]    |
[INFO] [stderr] 84 |         for (i, n) in rng.sample_iter(&Alphanumeric).take(PRE_LEN).enumerate() {
[INFO] [stderr]    |                           ^^^^^^^^^^^ method cannot be called on `OsRng` due to unsatisfied trait bounds
[INFO] [stderr]    |
[INFO] [stderr]   ::: /opt/rustwide/cargo-home/registry/src/index.crates.io-1949cf8c6b5b557f/rand_core-0.9.3/src/os.rs:47:1
[INFO] [stderr]    |
[INFO] [stderr] 47 | pub struct OsRng;
[INFO] [stderr]    | ---------------- doesn't satisfy `OsRng: RngCore` or `OsRng: Rng`
[INFO] [stderr]    |
[INFO] [stderr]    = note: the following trait bounds were not satisfied:
[INFO] [stderr]            `OsRng: RngCore`
[INFO] [stderr]            which is required by `OsRng: Rng`
[INFO] [stderr]            `&OsRng: RngCore`
[INFO] [stderr]            which is required by `&OsRng: Rng`
[INFO] [stderr]            `&mut OsRng: RngCore`
[INFO] [stderr]            which is required by `&mut OsRng: Rng`
[INFO] [stderr] 
[INFO] [stderr] error[E0599]: the method `sample_iter` exists for struct `OsRng`, but its trait bounds were not satisfied
[INFO] [stderr]   --> /opt/rustwide/cargo-home/registry/src/index.crates.io-1949cf8c6b5b557f/nuid-0.3.2/src/lib.rs:82:27
[INFO] [stderr]    |
[INFO] [stderr] 82 |         for (i, n) in rng.sample_iter(&Alphanumeric).take(PRE_LEN).enumerate() {
[INFO] [stderr]    |                           ^^^^^^^^^^^ method cannot be called on `OsRng` due to unsatisfied trait bounds
[INFO] [stderr]    |
[INFO] [stderr]   ::: /opt/rustwide/cargo-home/registry/src/index.crates.io-1949cf8c6b5b557f/rand_core-0.9.3/src/os.rs:47:1
[INFO] [stderr]    |
[INFO] [stderr] 47 | pub struct OsRng;
[INFO] [stderr]    | ---------------- doesn't satisfy `OsRng: RngCore` or `OsRng: Rng`
[INFO] [stderr]    |
[INFO] [stderr]    = note: the following trait bounds were not satisfied:
[INFO] [stderr]            `OsRng: RngCore`
[INFO] [stderr]            which is required by `OsRng: Rng`
[INFO] [stderr]            `&OsRng: RngCore`
[INFO] [stderr]            which is required by `&OsRng: Rng`
[INFO] [stderr]            `&mut OsRng: RngCore`
[INFO] [stderr]            which is required by `&mut OsRng: Rng`
[INFO] [stderr] 
[INFO] [stderr] Some errors have detailed explanations: E0432, E0599.
[INFO] [stderr] For more information about an error, try `rustc --explain E0432`.
[INFO] [stderr] error: could not compile `nuid` (lib) due to 2 previous errors
[INFO] [stderr] warning: build failed, waiting for other jobs to finish...
[INFO] [stderr] error: could not compile `nuid` (lib) due to 2 previous errors
[INFO] running `Command { std: "docker" "inspect" "8a875d284ccfbb7e55ad6ef5c6dfcbb19c92a03b72ae5a5ee7216e13774ea6f1", kill_on_drop: false }`
[INFO] running `Command { std: "docker" "rm" "-f" "8a875d284ccfbb7e55ad6ef5c6dfcbb19c92a03b72ae5a5ee7216e13774ea6f1", kill_on_drop: false }`
[INFO] [stdout] 8a875d284ccfbb7e55ad6ef5c6dfcbb19c92a03b72ae5a5ee7216e13774ea6f1