vat 0.1.0

VAT number validation and VAT rates for the EU
Build #103587 2018-06-06T06:13:01.570709+00:00
# rustc version
rustc 1.28.0-dev (b9bf4f162 2018-06-02)
# version
cratesfyi 0.5.0 (579f83b 2018-03-05)

# build log
Build failed, waiting for other jobs to finish...
Updating registry ``
Fresh version_check v0.1.3
Fresh typeable v0.1.2
Fresh cfg-if v0.1.3
Fresh utf8-ranges v0.1.3
Fresh pkg-config v0.3.11
Fresh lazy_static v0.2.11
Fresh matches v0.1.6
Fresh gcc v0.3.54
Fresh quick-error v1.2.2
Fresh language-tags v0.2.2
Fresh winapi-build v0.1.1
Fresh unicode-bidi v0.3.4
Fresh unicode-normalization v0.1.7
Fresh log v0.4.2
Fresh bitflags v0.7.0
Fresh percent-encoding v1.0.1
Fresh rustc-serialize v0.3.24
Fresh idna v0.1.4
Fresh httparse v1.2.4
Fresh log v0.3.9
Fresh winapi v0.2.8
Fresh unicase v1.4.2
Fresh regex-syntax v0.3.9
Fresh url v1.7.0
Fresh mime v0.2.6
Fresh hpack v0.2.0
Fresh libc v0.2.42
Compiling openssl-sys-extras v0.7.14
Fresh traitobject v0.0.1
Compiling openssl v0.7.14
Fresh solicit v0.4.4
Fresh kernel32-sys v0.2.2
Fresh num_cpus v1.8.0
Fresh memchr v0.1.11
Fresh time v0.1.40
Running `/home/cratesfyi/cratesfyi/debug/build/openssl-sys-extras-abe14868179e9a5e/build-script-build`
Fresh openssl-sys v0.7.17
Running `/home/cratesfyi/cratesfyi/debug/build/openssl-5643e7fc215043a9/build-script-build`
Fresh thread-id v2.0.0
Fresh aho-corasick v0.5.3
Fresh thread_local v0.2.7
Fresh regex v0.1.80
error: failed to run custom build command for `openssl-sys-extras v0.7.14`
process didn't exit successfully: `/home/cratesfyi/cratesfyi/debug/build/openssl-sys-extras-abe14868179e9a5e/build-script-build` (exit code: 101)
--- stdout
TARGET = Some("x86_64-unknown-linux-gnu")
OPT_LEVEL = Some("0")
TARGET = Some("x86_64-unknown-linux-gnu")
HOST = Some("x86_64-unknown-linux-gnu")
TARGET = Some("x86_64-unknown-linux-gnu")
TARGET = Some("x86_64-unknown-linux-gnu")
HOST = Some("x86_64-unknown-linux-gnu")
CC_x86_64-unknown-linux-gnu = None
CC_x86_64_unknown_linux_gnu = None
HOST_CC = None
CC = None
HOST = Some("x86_64-unknown-linux-gnu")
TARGET = Some("x86_64-unknown-linux-gnu")
HOST = Some("x86_64-unknown-linux-gnu")
CFLAGS_x86_64-unknown-linux-gnu = None
CFLAGS_x86_64_unknown_linux_gnu = None
DEBUG = Some("true")
running: "cc" "-O0" "-ffunction-sections" "-fdata-sections" "-fPIC" "-g" "-m64" "-Wall" "-Wextra" "-o" "/home/cratesfyi/cratesfyi/debug/build/openssl-sys-extras-e60f1107e2e04baa/out/src/openssl_shim.o" "-c" "src/openssl_shim.c"
cargo:warning=src/openssl_shim.c: In function ‘SSL_CTX_set_ecdh_auto_shim’:
cargo:warning=src/openssl_shim.c:121:41: warning: unused parameter ‘ctx’ [-Wunused-parameter]
cargo:warning= int SSL_CTX_set_ecdh_auto_shim(SSL_CTX *ctx, int onoff) {
cargo:warning=                                         ^~~
cargo:warning=src/openssl_shim.c: In function ‘DH_new_from_params’:
cargo:warning=src/openssl_shim.c:132:7: error: dereferencing pointer to incomplete type ‘DH {aka struct dh_st}’
cargo:warning=     dh->p = p;
cargo:warning=       ^~
cargo:warning=src/openssl_shim.c: In function ‘X509_get_extensions_shim’:
cargo:warning=src/openssl_shim.c:143:13: error: dereferencing pointer to incomplete type ‘X509 {aka struct x509_st}’
cargo:warning=     return x->cert_info ? x->cert_info->extensions : NULL;
cargo:warning=             ^~
cargo:warning=src/openssl_shim.c:144:1: warning: control reaches end of non-void function [-Wreturn-type]
cargo:warning= }
cargo:warning= ^
exit code: 1

--- stderr
thread 'main' panicked at '

Internal error occurred: Command "cc" "-O0" "-ffunction-sections" "-fdata-sections" "-fPIC" "-g" "-m64" "-Wall" "-Wextra" "-o" "/home/cratesfyi/cratesfyi/debug/build/openssl-sys-extras-e60f1107e2e04baa/out/src/openssl_shim.o" "-c" "src/openssl_shim.c" with args "cc" did not execute successfully (status code exit code: 1).

', .cargo/registry/src/
note: Run with `RUST_BACKTRACE=1` for a backtrace.

thread 'main' panicked at 'Error(
build failed
State {
next_error: None,
backtrace: None
)', src/bin/
note: Run with `RUST_BACKTRACE=1` for a backtrace.